{"text_format":"1","workbook":"xlsx","n_sheets":28,"sheets":["Inhaltsverzeichnis","1. Prod + AH + Verbrauch","2.1 Imp.n.H.","2.2 Imp.n.Kont.","2.3 aVV","2.4 Imp. LM","3. MEM","4. PP","5. GHP","6. KP","7. MS","8. BWS","9. Int.","Dashboard","D.1 Prod + AH + Verbrauch","D.2.1 Imp.n.H.","D.2.2 Imp.n.Kont.","D.2.3 aVV","D.2.4 Imp.LM","D.3 MEM","D.4 PP","D.5 GHP Gastro","D.6 KP","D.7 MS","D.8 BWS","D.9 Int.","10. Methoden","Codierung"],"not_rendered":{"charts":166,"images":5,"macros":1,"external_links":2,"defined_names":7,"comments":1,"pivot_tables":0},"unopened":[],"bounds":{"document_bytes":16777216,"sheet_cells":100000,"rows_first":2000,"rows_last":500,"rows_between":2000,"halvings":0,"cell_chars":16384,"cell_head_chars":4096},"cells_cut":0,"cells_raw":0,"read":"whole","date_system":"1900"}

{"sheet":"Inhaltsverzeichnis","index":0,"n_rows":53,"n_cols":6,"rows_kept":53,"cut":false,"hidden":false,"merged":[[46,1,46,2]]}
[null,null,null,null,null,{"$f":"Codierung!I184","v":"Eidgenössisches Departement für  Wirtschaft, Bildung und Forschung WBF"}]
[null,null,null,null,null,{"$f":"Codierung!I185","v":"Bundesamt für Landwirtschaft BLW"}]
[null,null,null,null,null,{"$f":"Codierung!I186","v":"Fachbereich Marktanalysen"}]
[]
[]
[{"$f":"Codierung!$I$168","v":"Marktbericht Eier"}]
[{"$f":"Codierung!$I$125","v":"Inhaltsverzeichnis"}]
[]
[null,{"$f":"Codierung!$I$124","v":"Marktbericht: "}]
[null,null,{"$f":"Codierung!$I$125","v":"Inhaltsverzeichnis"}]
[null,null,{"$f":"Codierung!$I$127","v":"1. Produktion, Aussenhandel und Verbrauch (Prod + AH + Verbrauch)"}]
[null,null,{"$f":"Codierung!$I$128","v":"2.1 Import nach Herkunft (Imp.n.H.)"}]
[null,null,{"$f":"Codierung!$I$129","v":"2.2 Auslastung der Importkontingente (Imp.n.Kont.)"}]
[null,null,{"$f":"Codierung!$I$130","v":"2.3 Aktiver Veredelungsverkehr (aVV)"}]
[null,null,{"$f":"Codierung!$I$131","v":"2.4 \"Versteckte\" Eierimporte in Lebensmittelzubereitungen (Imp. LM): Inoffizielle Schätzung"}]
[null,null,{"$f":"Codierung!$I$132","v":"3. Marktentlastungsmassnahmen (MEM)"}]
[null,null,{"$f":"Codierung!$I$133","v":"4. Produzenten- und Importpreise (PP)"}]
[null,null,{"$f":"Codierung!$I$134","v":"5. Preise im Liefer- und Abholgrosshandel (GHP)"}]
[null,null,{"$f":"Codierung!$I$135","v":"6. Konsumentenpreise (KP)"}]
[null,null,{"$f":"Codierung!$I$136","v":"7. Marktstruktur (MS)"}]
[null,null,{"$f":"Codierung!$I$137","v":"8. Bruttowertschöpfung (BWS)"}]
[null,null,{"$f":"Codierung!$I$138","v":"9. International (Int.)"}]
[]
[null,{"$f":"Codierung!$I$139","v":"Datenreihen: "}]
[null,null,{"$f":"Codierung!$I$140","v":"D.1 Prod + AH + Verbrauch"}]
[null,null,{"$f":"Codierung!$I$141","v":"D.2.1 Imp.n.H."}]
[null,null,{"$f":"Codierung!$I$142","v":"D.2.2 Imp.n.Kont."}]
[null,null,{"$f":"Codierung!$I$143","v":"D.2.3 aVV"}]
[null,null,{"$f":"Codierung!$I$144","v":"D.2.4 Imp. LM"}]
[null,null,{"$f":"Codierung!$I$145","v":"D.3 MEM"}]
[null,null,{"$f":"Codierung!$I$146","v":"D.4 PP"}]
[null,null,{"$f":"Codierung!$I$147","v":"D.5 GHP Gastro"}]
[null,null,{"$f":"Codierung!$I$148","v":"D.6 KP"}]
[null,null,{"$f":"Codierung!$I$149","v":"D.7 MS"}]
[null,null,{"$f":"Codierung!$I$150","v":"D.8 BWS"}]
[null,null,{"$f":"Codierung!$I$151","v":"D.9 Int."}]
[]
[null,null,{"$f":"Codierung!$I$152","v":"10. Methoden"}]
[]
[null,null,{"$f":"Codierung!$I$153","v":"Codierung"}]
[]
[null,{"$f":"Codierung!$I$156","v":"Bestellformular für Abonnemente:"}]
[null,null,"Deutsch"]
[null,null,"Français"]
[null,null,"Italiano"]
[]
[null,{"$f":"Codierung!$I$241","v":"Zu Haftung, Datenschutz, Copyright und Weiterem siehe:"}]
[null,"www.disclaimer.admin.ch"]
[]
[null,"Schwarzenburgstrasse 165, 3003 Bern"]
[null,"Tel. +41 58 462 25 11, Fax +41 58 462 26 34"]
[null,"marktanalysen@blw.admin.ch"]
[null,"www.marktbeobachtung.admin.ch"]

{"sheet":"1. Prod + AH + Verbrauch","index":1,"n_rows":50,"n_cols":11,"rows_kept":50,"cut":false,"hidden":false,"merged":[[23,1,25,1],[18,1,20,1],[41,0,49,0],[27,0,39,0],[22,0,25,0],[17,0,20,0],[47,1,49,1],[44,1,46,1],[41,1,43,1],[37,1,39,1],[32,1,36,1],[27,1,31,1]]}
[null,null,null,null,null,{"$f":"Codierung!I184","v":"Eidgenössisches Departement für  Wirtschaft, Bildung und Forschung WBF"}]
[null,null,null,null,null,{"$f":"Codierung!I185","v":"Bundesamt für Landwirtschaft BLW"}]
[null,null,null,null,null,{"$f":"Codierung!I186","v":"Fachbereich Marktanalysen"}]
[]
[]
[{"$f":"Codierung!$I$170","v":"Produktion, Aussenhandel und Verbrauch"},null,null,null,null,{"$f":"Codierung!I242","v":"Anmerkungen:"}]
[{"$f":"Codierung!$I$222","v":"in Mio. Stück"},null,null,null,null,"(2)",{"$f":"Codierung!I244","v":"Schätzung Agristat (SBV)"}]
[{"$f":"Codierung!$I$224","v":"in %"},null,null,null,null,"(3)",{"$f":"Codierung!I245","v":"Bis 2015: Berechnung/Schätzung Aviforum; ab 2016: Erhebung BLW"}]
[{"$f":"Codierung!$I$223","v":"in Stück / Kopf"},null,null,null,null,"(5)",{"$f":"Codierung!I251","v":"Umrechnungsfaktoren: Eiprodukte getrocknet 80 Eier / kg; Eiprodukte flüssig 20.58 Eier / kg; Schaleneier 16.6 Eier / kg"}]
[{"$f":"Codierung!I210","v":"Quellen: BLW, Fachbereich Marktanalysen; SBV; EZV; Aviforum"},null,null,null,null,"(6)",{"$f":"Codierung!I260","v":"2017: Erweiterung Erhebung Kükenstatistik aufgrund angepasster Marktverhältnisse (Erhöhung Inlandproduktion um ca. 17 Mio. Eier bzw. ca. + 2 Eier / Kopf)"}]
[{"$f":"Codierung!I215","v":"Publikationsrecht: Weiterverarbeitung und Publikation unter Quellenangabe gestattet."},null,null,null,null,null,{"$f":"Codierung!$I$238","v":"Daten Import"}]
[null,null,null,null,null,null,{"$f":"Codierung!$I$256","v":"Aufbereitete Grafiken unterhalb der Datentabellen"}]
[{"$f":"Codierung!$I$154","v":"Zurück zum Inhaltsverzeichnis"}]
[{"$f":"Codierung!$I$253","v":"Informationen zur Methodik"},null,null,null,{"$f":"Codierung!$I$252&'D.1 Prod + AH + Verbrauch'!$A$29&\"-\"&'D.1 Prod + AH + Verbrauch'!$A$33","v":"Ø 2001-2005"},{"$f":"Codierung!$I$252&'D.1 Prod + AH + Verbrauch'!$A$34&\"-\"&'D.1 Prod + AH + Verbrauch'!$A$38","v":"Ø 2006-2010"},{"$f":"'D.1 Prod + AH + Verbrauch'!$A$49","v":2021},{"$f":"'D.1 Prod + AH + Verbrauch'!$A$50","v":2022},{"$f":"Codierung!$I$237&\" \"&E14","v":"%-∆ Ø 2001-2005"},{"$f":"Codierung!$I$237&\" \"&F14","v":"%-∆ Ø 2006-2010"},{"$f":"Codierung!$I$233","v":"%-∆ Vorjahr"}]
[]
[{"$f":"Codierung!$I$27","v":"Bevölkerung"},null,{"$f":"Codierung!$I$38","v":"Ø-Bevölkerung inkl. Tourismus und Grenzgänger (2)"},{"$f":"Codierung!$I$225","v":"in Anz. Personen"},{"$f":"AVERAGE('D.1 Prod + AH + Verbrauch'!$B$29:$B$33)","v":7508000},{"$f":"AVERAGE('D.1 Prod + AH + Verbrauch'!$B$34:$B$38)","v":7812000},{"$f":"'D.1 Prod + AH + Verbrauch'!$B$49","v":8800000},{"$f":"'D.1 Prod + AH + Verbrauch'!$B$50","v":8910000},{"$f":"IFERROR((H16-E16)/E16*100,\"-\")","v":18.673415023974428},{"$f":"IFERROR((H16-F16)/F16*100,\"-\")","v":14.055299539170507},{"$f":"IFERROR((H16-G16)/G16*100,\"-\")","v":1.25}]
[null,null,null,null,null,null,null,null,null,{"$f":"IFERROR((H17-F17)/F17*100,\"-\")","v":"-"}]
[{"$f":"Codierung!$I$28","v":"Schaleneier"},{"$f":"Codierung!$I$32","v":"Inland"},{"$f":"Codierung!$I$39","v":"Produktion Total"},{"$f":"Codierung!$I$222","v":"in Mio. Stück"},{"$f":"AVERAGE('D.1 Prod + AH + Verbrauch'!$C$29:$C$33)","v":676.43920000000026},{"$f":"AVERAGE('D.1 Prod + AH + Verbrauch'!$C$34:$C$38)","v":698.94499999999994},{"$f":"'D.1 Prod + AH + Verbrauch'!$C$49","v":1145.3840000000027},{"$f":"'D.1 Prod + AH + Verbrauch'!$C$50","v":1134.7349999999992},{"$f":"IFERROR((H18-E18)/E18*100,\"-\")","v":67.751218439144083},62.349684166851368,{"$f":"IFERROR((H18-G18)/G18*100,\"-\")","v":-0.92973186285154141}]
[null,{"$f":"Codierung!$I$33","v":"Import (abzügl. Exporte und Rückwaren)"},{"$f":"Codierung!$I$40","v":"Konsumeier"},"In Mio. Stück",{"$f":"AVERAGE('D.1 Prod + AH + Verbrauch'!$D$29:$D$33)","v":228.81680384000001},{"$f":"AVERAGE('D.1 Prod + AH + Verbrauch'!$D$34:$D$38)","v":247.37700803999996},{"$f":"'D.1 Prod + AH + Verbrauch'!$D$49","v":284.63706719820016},{"$f":"'D.1 Prod + AH + Verbrauch'!$D$50","v":256.20701888240006},{"$f":"IFERROR((H19-E19)/E19*100,\"-\")","v":11.970368689160017},3.5694549434328668,{"$f":"IFERROR((H19-G19)/G19*100,\"-\")","v":-9.9881749751178805}]
[null,null,{"$f":"Codierung!$I$41","v":"Verarbeitungseier"},{"$f":"Codierung!$I$222","v":"in Mio. Stück"},{"$f":"AVERAGE('D.1 Prod + AH + Verbrauch'!$E$29:$E$33)","v":198.18392804000001},{"$f":"AVERAGE('D.1 Prod + AH + Verbrauch'!$E$34:$E$38)","v":254.41685556000002},{"$f":"'D.1 Prod + AH + Verbrauch'!$E$49","v":126.44893953360001},{"$f":"'D.1 Prod + AH + Verbrauch'!$E$50","v":94.163949195999976},{"$f":"IFERROR((H20-E20)/E20*100,\"-\")","v":-52.48658651220466},-62.988321277403344,{"$f":"IFERROR((H20-G20)/G20*100,\"-\")","v":-25.532037244979243}]
[null,null,{"$f":"Codierung!$I$36","v":"Total"},{"$f":"Codierung!$I$222","v":"in Mio. Stück"},{"$f":"AVERAGE('D.1 Prod + AH + Verbrauch'!$F$29:$F$33)","v":427.00073187999999},{"$f":"AVERAGE('D.1 Prod + AH + Verbrauch'!$F$34:$F$38)","v":501.79386360000001},{"$f":"'D.1 Prod + AH + Verbrauch'!$F$49","v":411.08600673180018},{"$f":"'D.1 Prod + AH + Verbrauch'!$F$50","v":350.37096807840004},{"$f":"IFERROR((H21-E21)/E21*100,\"-\")","v":-17.946049755983839},-30.176314719206136,{"$f":"IFERROR((H21-G21)/G21*100,\"-\")","v":-14.769424806281892}]
[]
[{"$f":"Codierung!$I$29","v":"Eiprodukte (5)"},{"$f":"Codierung!$I$32","v":"Inland"},{"$f":"Codierung!$I$42","v":"Verarbeitung CH-Eier zu Eiprodukten (3)"},{"$f":"Codierung!$I$222","v":"in Mio. Stück"},{"$f":"AVERAGE('D.1 Prod + AH + Verbrauch'!$G$29:$G$33)","v":23},{"$f":"AVERAGE('D.1 Prod + AH + Verbrauch'!$G$34:$G$38)","v":32},{"$f":"'D.1 Prod + AH + Verbrauch'!$G$49","v":134.71399636000001},{"$f":"'D.1 Prod + AH + Verbrauch'!$G$50","v":161.87722162},{"$f":"IFERROR((H23-E23)/E23*100,\"-\")","v":603.81400704347823},{"$f":"IFERROR((H23-F23)/F23*100,\"-\")","v":405.8663175625},{"$f":"IFERROR((H23-G23)/G23*100,\"-\")","v":20.163625156966567}]
[null,{"$f":"Codierung!$I$33","v":"Import (abzügl. Exporte und Rückwaren)"},{"$f":"Codierung!$I$43","v":"Eiprodukte flüssig"},{"$f":"Codierung!$I$222","v":"in Mio. Stück"},{"$f":"AVERAGE('D.1 Prod + AH + Verbrauch'!$H$29:$H$33)","v":170.48321826800006},{"$f":"AVERAGE('D.1 Prod + AH + Verbrauch'!$H$34:$H$38)","v":106.61725426800001},{"$f":"'D.1 Prod + AH + Verbrauch'!$H$49","v":124.05305722067997},{"$f":"'D.1 Prod + AH + Verbrauch'!$H$50","v":129.41452741560002},{"$f":"IFERROR((H24-E24)/E24*100,\"-\")","v":-24.089579766050608},{"$f":"IFERROR((H24-F24)/F24*100,\"-\")","v":21.382348761575976},{"$f":"IFERROR((H24-G24)/G24*100,\"-\")","v":4.3219170208618394}]
[null,null,{"$f":"Codierung!$I$44","v":"Eiprodukte getrocknet"},{"$f":"Codierung!$I$222","v":"in Mio. Stück"},{"$f":"AVERAGE('D.1 Prod + AH + Verbrauch'!$I$29:$I$33)","v":57.607528000000002},{"$f":"AVERAGE('D.1 Prod + AH + Verbrauch'!$I$34:$I$38)","v":59.931632},{"$f":"'D.1 Prod + AH + Verbrauch'!$I$49","v":36.925819120000007},{"$f":"'D.1 Prod + AH + Verbrauch'!$I$50","v":39.501503039999996},{"$f":"IFERROR((H25-E25)/E25*100,\"-\")","v":-31.429963389507019},{"$f":"IFERROR((H25-F25)/F25*100,\"-\")","v":-34.08905827894025},{"$f":"IFERROR((H25-G25)/G25*100,\"-\")","v":6.9752925768000908}]
[null,null,{"$f":"Codierung!$I$41","v":"Verarbeitungseier"},{"$f":"Codierung!$I$222","v":"in Mio. Stück"},{"$f":"AVERAGE('D.1 Prod + AH + Verbrauch'!$J$29:$J$33)","v":198.18392804000001},{"$f":"AVERAGE('D.1 Prod + AH + Verbrauch'!$J$34:$J$38)","v":254.41685556000002},{"$f":"'D.1 Prod + AH + Verbrauch'!$J$49","v":126.44893953360001},{"$f":"'D.1 Prod + AH + Verbrauch'!$J$50","v":94.163949195999976},{"$f":"IFERROR((H26-E26)/E26*100,\"-\")","v":-52.48658651220466},{"$f":"IFERROR((H26-F26)/F26*100,\"-\")","v":-62.988321277403344},{"$f":"IFERROR((H26-G26)/G26*100,\"-\")","v":-25.532037244979243}]
[]
[{"$f":"Codierung!$I$30","v":"Verbrauch Inland"},{"$f":"Codierung!$I$34","v":"Schaleneier (exkl. Verarbeitungseier)"},{"$f":"Codierung!$I$32","v":"Inland"},{"$f":"Codierung!$I$222","v":"in Mio. Stück"},{"$f":"AVERAGE('D.1 Prod + AH + Verbrauch'!$K$29:$K$33)","v":653.43920000000026},{"$f":"AVERAGE('D.1 Prod + AH + Verbrauch'!$K$34:$K$38)","v":666.94499999999994},{"$f":"'D.1 Prod + AH + Verbrauch'!$K$49","v":1010.6700036400027},{"$f":"'D.1 Prod + AH + Verbrauch'!$K$50","v":972.85777837999922},{"$f":"IFERROR((H28-E28)/E28*100,\"-\")","v":48.882677742626832},{"$f":"IFERROR((H28-F28)/F28*100,\"-\")","v":45.867766964292308},{"$f":"IFERROR((H28-G28)/G28*100,\"-\")","v":-3.7413028113845259}]
[null,null,{"$f":"Codierung!$I$45","v":"Import"},{"$f":"Codierung!$I$222","v":"in Mio. Stück"},{"$f":"AVERAGE('D.1 Prod + AH + Verbrauch'!$L$29:$L$33)","v":228.81680384000001},{"$f":"AVERAGE('D.1 Prod + AH + Verbrauch'!$L$34:$L$38)","v":247.37700803999996},{"$f":"'D.1 Prod + AH + Verbrauch'!$L$49","v":284.63706719820016},{"$f":"'D.1 Prod + AH + Verbrauch'!$L$50","v":256.20701888240006},11.970368689160017,3.5694549434328668,-9.9881749751178805]
[null,null,{"$f":"Codierung!$I$36","v":"Total"},{"$f":"Codierung!$I$222","v":"in Mio. Stück"},{"$f":"AVERAGE('D.1 Prod + AH + Verbrauch'!$M$29:$M$33)","v":882.25600384000029},{"$f":"AVERAGE('D.1 Prod + AH + Verbrauch'!$M$34:$M$38)","v":914.3220080399999},{"$f":"'D.1 Prod + AH + Verbrauch'!$M$49","v":1295.3070708382029},{"$f":"'D.1 Prod + AH + Verbrauch'!$M$50","v":1229.0647972623992},39.309315200227722,34.423626080827084,-5.1140208424044031]
[null,null,{"$f":"Codierung!$I$46","v":"Anteil Inland"},{"$f":"Codierung!$I$224","v":"in %"},{"$f":"AVERAGE('D.1 Prod + AH + Verbrauch'!$N$29:$N$33)","v":0.74049206864325323},{"$f":"AVERAGE('D.1 Prod + AH + Verbrauch'!$N$34:$N$38)","v":0.72941133333772412},{"$f":"'D.1 Prod + AH + Verbrauch'!$N$49","v":0.78025514288746267},{"$f":"'D.1 Prod + AH + Verbrauch'!$N$50","v":0.7915431151774327},6.8942057175192142,8.5180719026394662,1.4467027090903914]
[null,null,{"$f":"Codierung!$I$47","v":"Anteil Import"},{"$f":"Codierung!$I$224","v":"in %"},{"$f":"AVERAGE('D.1 Prod + AH + Verbrauch'!$O$29:$O$33)","v":0.25950793135674688},{"$f":"AVERAGE('D.1 Prod + AH + Verbrauch'!$O$34:$O$38)","v":0.27058866666227577},{"$f":"'D.1 Prod + AH + Verbrauch'!$O$49","v":0.21974485711253733},{"$f":"'D.1 Prod + AH + Verbrauch'!$O$50","v":0.20845688482256736},-19.672249039663988,-22.961708857250724,-5.1368539124395038]
[null,{"$f":"Codierung!$I$35","v":"Eiprodukte (inkl. Verarbeitungseier)"},{"$f":"Codierung!$I$48","v":"Inland (3)"},{"$f":"Codierung!$I$222","v":"in Mio. Stück"},{"$f":"AVERAGE('D.1 Prod + AH + Verbrauch'!$P$29:$P$33)","v":23},{"$f":"AVERAGE('D.1 Prod + AH + Verbrauch'!$P$34:$P$38)","v":32},{"$f":"'D.1 Prod + AH + Verbrauch'!$P$49","v":134.71399636000001},{"$f":"'D.1 Prod + AH + Verbrauch'!$P$50","v":161.87722162},603.81400704347823,405.8663175625,20.163625156966567]
[null,null,{"$f":"Codierung!$I$45","v":"Import"},{"$f":"Codierung!$I$222","v":"in Mio. Stück"},{"$f":"AVERAGE('D.1 Prod + AH + Verbrauch'!$Q$29:$Q$33)","v":426.27467430800004},{"$f":"AVERAGE('D.1 Prod + AH + Verbrauch'!$Q$34:$Q$38)","v":420.96574182800003},{"$f":"'D.1 Prod + AH + Verbrauch'!$Q$49","v":287.42781587427999},{"$f":"'D.1 Prod + AH + Verbrauch'!$Q$50","v":263.07997965159996},-38.283929234436656,-37.505608292683753,-8.4709394421762223]
[null,null,{"$f":"Codierung!$I$36","v":"Total"},{"$f":"Codierung!$I$222","v":"in Mio. Stück"},{"$f":"AVERAGE('D.1 Prod + AH + Verbrauch'!$R$29:$R$33)","v":449.27467430800004},{"$f":"AVERAGE('D.1 Prod + AH + Verbrauch'!$R$34:$R$38)","v":452.96574182800003},{"$f":"'D.1 Prod + AH + Verbrauch'!$R$49","v":422.14181223428},{"$f":"'D.1 Prod + AH + Verbrauch'!$R$50","v":424.95720127159996},-5.4126071258869253,-6.1833684029542946,0.66692967996202124]
[null,null,{"$f":"Codierung!$I$46","v":"Anteil Inland"},{"$f":"Codierung!$I$224","v":"in %"},{"$f":"AVERAGE('D.1 Prod + AH + Verbrauch'!$S$29:$S$33)","v":5.1678331130477276E-2},{"$f":"AVERAGE('D.1 Prod + AH + Verbrauch'!$S$34:$S$38)","v":7.0539383189169191E-2},{"$f":"'D.1 Prod + AH + Verbrauch'!$S$49","v":0.31912023982413884},{"$f":"'D.1 Prod + AH + Verbrauch'!$S$50","v":0.38092594062558438},637.10960143783257,440.01881417652203,19.36752768658782]
[null,null,{"$f":"Codierung!$I$47","v":"Anteil Import"},{"$f":"Codierung!$I$224","v":"in %"},{"$f":"AVERAGE('D.1 Prod + AH + Verbrauch'!$T$29:$T$33)","v":0.94832166886952274},{"$f":"AVERAGE('D.1 Prod + AH + Verbrauch'!$T$34:$T$38)","v":0.92946061681083081},{"$f":"'D.1 Prod + AH + Verbrauch'!$T$49","v":0.68087976017586116},{"$f":"'D.1 Prod + AH + Verbrauch'!$T$50","v":0.61907405937441562},-34.718979888711949,-33.394266720134404,-9.0773297161134643]
[null,{"$f":"Codierung!$I$36","v":"Total"},null,{"$f":"Codierung!$I$222","v":"in Mio. Stück"},{"$f":"AVERAGE('D.1 Prod + AH + Verbrauch'!$U$29:$U$33)","v":1331.5306781480003},{"$f":"AVERAGE('D.1 Prod + AH + Verbrauch'!$U$34:$U$38)","v":1367.287749868},{"$f":"'D.1 Prod + AH + Verbrauch'!$U$49","v":1717.4488830724829},{"$f":"'D.1 Prod + AH + Verbrauch'!$U$50","v":1654.0219985339991},24.219593711092376,20.971024474817451,-3.6930871808548003]
[null,null,{"$f":"Codierung!$I$46","v":"Anteil Inland"},{"$f":"Codierung!$I$224","v":"in %"},{"$f":"AVERAGE('D.1 Prod + AH + Verbrauch'!$V$29:$V$33)","v":0.5082035751698124},{"$f":"AVERAGE('D.1 Prod + AH + Verbrauch'!$V$34:$V$38)","v":0.51107127754015591},{"$f":"'D.1 Prod + AH + Verbrauch'!$V$49","v":0.66691009629988685},{"$f":"'D.1 Prod + AH + Verbrauch'!$V$50","v":0.68604589358892631},34.994306830621809,34.236832265538986,2.8693218763979771]
[null,null,{"$f":"Codierung!$I$47","v":"Anteil Import"},{"$f":"Codierung!$I$224","v":"in %"},{"$f":"AVERAGE('D.1 Prod + AH + Verbrauch'!$W$29:$W$33)","v":0.49179642483018754},{"$f":"AVERAGE('D.1 Prod + AH + Verbrauch'!$W$34:$W$38)","v":0.48892872245984398},{"$f":"'D.1 Prod + AH + Verbrauch'!$W$49","v":0.3330899037001131},{"$f":"'D.1 Prod + AH + Verbrauch'!$W$50","v":0.3139541064110738},-36.161775368847174,-35.787346500826807,-5.7449346487150237]
[]
[{"$f":"Codierung!$I$31","v":"Pro-Kopf-Verbrauch"},{"$f":"Codierung!$I$36","v":"Total"},{"$f":"Codierung!$I$32","v":"Inland"},{"$f":"Codierung!$I$223","v":"in Stück / Kopf"},{"$f":"AVERAGE('D.1 Prod + AH + Verbrauch'!$X$29:$X$33)","v":90.120052557813864},{"$f":"AVERAGE('D.1 Prod + AH + Verbrauch'!$X$34:$X$38)","v":89.430878794376696},{"$f":"'D.1 Prod + AH + Verbrauch'!$X$49","v":130.15727272727304},{"$f":"'D.1 Prod + AH + Verbrauch'!$X$50","v":127.35521885521875},{"$f":"IFERROR((H42-E42)/E42*100,\"-\")","v":41.317293144628117},{"$f":"IFERROR((H42-F42)/F42*100,\"-\")","v":42.406314879270418},{"$f":"IFERROR((H42-G42)/G42*100,\"-\")","v":-2.152821592939806}]
[null,null,{"$f":"Codierung!$I$45","v":"Import"},{"$f":"Codierung!$I$223","v":"in Stück / Kopf"},{"$f":"AVERAGE('D.1 Prod + AH + Verbrauch'!$Y$29:$Y$33)","v":87.291914961642831},{"$f":"AVERAGE('D.1 Prod + AH + Verbrauch'!$Y$34:$Y$38)","v":85.534334355375591},{"$f":"'D.1 Prod + AH + Verbrauch'!$Y$49","v":65.007373076418205},{"$f":"'D.1 Prod + AH + Verbrauch'!$Y$50","v":58.281369083501687},-33.233943705884727,-31.862018307927748,-10.346524824207078]
[null,null,{"$f":"Codierung!$I$36","v":"Total"},{"$f":"Codierung!$I$223","v":"in Stück / Kopf"},{"$f":"AVERAGE('D.1 Prod + AH + Verbrauch'!$Z$29:$Z$33)","v":177.41196751945671},{"$f":"AVERAGE('D.1 Prod + AH + Verbrauch'!$Z$34:$Z$38)","v":174.96521314975229},{"$f":"'D.1 Prod + AH + Verbrauch'!$Z$49","v":195.16464580369126},{"$f":"'D.1 Prod + AH + Verbrauch'!$Z$50","v":185.63658793872042},4.6358881727421934,6.0991408502640665,-4.8820614131899411]
[null,{"$f":"Codierung!$I$28","v":"Schaleneier"},{"$f":"Codierung!$I$32","v":"Inland"},{"$f":"Codierung!$I$223","v":"in Stück / Kopf"},{"$f":"AVERAGE('D.1 Prod + AH + Verbrauch'!$AA$29:$AA$33)","v":87.060724128419167},{"$f":"AVERAGE('D.1 Prod + AH + Verbrauch'!$AA$34:$AA$38)","v":85.338841782918735},{"$f":"'D.1 Prod + AH + Verbrauch'!$AA$49","v":114.84886405000032},{"$f":"'D.1 Prod + AH + Verbrauch'!$AA$50","v":109.18718051402908},25.414969387312038,27.945468010656533,-4.9296817890217701]
[null,null,{"$f":"Codierung!$I$45","v":"Import"},{"$f":"Codierung!$I$223","v":"in Stück / Kopf"},{"$f":"AVERAGE('D.1 Prod + AH + Verbrauch'!$AB$29:$AB$33)","v":30.478657601286933},{"$f":"AVERAGE('D.1 Prod + AH + Verbrauch'!$AB$34:$AB$38)","v":31.65448644781096},{"$f":"'D.1 Prod + AH + Verbrauch'!$AB$49","v":32.345121272522746},{"$f":"'D.1 Prod + AH + Verbrauch'!$AB$50","v":28.754996507564542},-5.6553051524474345,-9.1598072362564906,-11.099432074190501]
[null,null,{"$f":"Codierung!$I$36","v":"Total"},{"$f":"Codierung!$I$223","v":"in Stück / Kopf"},{"$f":"AVERAGE('D.1 Prod + AH + Verbrauch'!$AC$29:$AC$33)","v":117.53938172970609},{"$f":"AVERAGE('D.1 Prod + AH + Verbrauch'!$AC$34:$AC$38)","v":116.99332823072969},{"$f":"'D.1 Prod + AH + Verbrauch'!$AC$49","v":147.19398532252308},{"$f":"'D.1 Prod + AH + Verbrauch'!$AC$50","v":137.94217702159364},17.35826324049064,17.906020033509471,-6.2854526838562093]
[null,{"$f":"Codierung!$I$37","v":"Eiprodukte"},{"$f":"Codierung!$I$32","v":"Inland"},{"$f":"Codierung!$I$223","v":"in Stück / Kopf"},{"$f":"AVERAGE('D.1 Prod + AH + Verbrauch'!$AD$29:$AD$33)","v":3.0593284293946885},{"$f":"AVERAGE('D.1 Prod + AH + Verbrauch'!$AD$34:$AD$38)","v":4.0920370114579798},{"$f":"'D.1 Prod + AH + Verbrauch'!$AD$49","v":15.308408677272729},{"$f":"'D.1 Prod + AH + Verbrauch'!$AD$50","v":18.168038341189675},493.85707551458796,343.98519100188832,18.680123611818836]
[null,null,{"$f":"Codierung!$I$45","v":"Import"},{"$f":"Codierung!$I$223","v":"in Stück / Kopf"},{"$f":"AVERAGE('D.1 Prod + AH + Verbrauch'!$AE$29:$AE$33)","v":56.813257360355898},{"$f":"AVERAGE('D.1 Prod + AH + Verbrauch'!$AE$34:$AE$38)","v":53.879847907564624},{"$f":"'D.1 Prod + AH + Verbrauch'!$AE$49","v":32.662251803895451},{"$f":"'D.1 Prod + AH + Verbrauch'!$AE$50","v":29.526372575937142},-48.029079922918577,-45.19959925166809,-9.6009278441246657]
[null,null,{"$f":"Codierung!$I$36","v":"Total"},{"$f":"Codierung!$I$223","v":"in Stück / Kopf"},{"$f":"AVERAGE('D.1 Prod + AH + Verbrauch'!$AF$29:$AF$33)","v":59.872585789750588},{"$f":"AVERAGE('D.1 Prod + AH + Verbrauch'!$AF$34:$AF$38)","v":57.9718849190226},{"$f":"'D.1 Prod + AH + Verbrauch'!$AF$49","v":47.970660481168181},{"$f":"'D.1 Prod + AH + Verbrauch'!$AF$50","v":47.694410917126817},-20.340151860801235,-17.728376464301206,-0.57587192102516882]

{"sheet":"2.1 Imp.n.H.","index":2,"n_rows":41,"n_cols":9,"rows_kept":41,"cut":false,"hidden":false,"merged":[[35,0,40,0],[21,0,26,0],[14,0,19,0],[28,0,33,0]]}
[null,null,null,null,null,{"$f":"Codierung!I184","v":"Eidgenössisches Departement für  Wirtschaft, Bildung und Forschung WBF"}]
[null,null,null,null,null,{"$f":"Codierung!I185","v":"Bundesamt für Landwirtschaft BLW"}]
[null,null,null,null,null,{"$f":"Codierung!I186","v":"Fachbereich Marktanalysen"}]
[]
[null,null,null,null,null,{"$f":"Codierung!I242","v":"Anmerkungen:"}]
[{"$f":"Codierung!$I$171","v":"Importe nach Herkunft"},null,null,null,null,{"$f":"Codierung!I251","v":"Umrechnungsfaktoren: Eiprodukte getrocknet 80 Eier / kg; Eiprodukte flüssig 20.58 Eier / kg; Schaleneier 16.6 Eier / kg"}]
[{"$f":"Codierung!$I$222","v":"in Mio. Stück"},null,null,null,null,{"$f":"Codierung!I258","v":"Importe ohne Veredelungsverkehr, inklusive Rückwaren"}]
[{"$f":"Codierung!$I$206","v":"Quellen: BLW, Fachbereich Marktanalysen; EZV"},null,null,null,null,{"$f":"Codierung!$I$256","v":"Aufbereitete Grafiken unterhalb der Datentabellen"}]
[{"$f":"Codierung!I215","v":"Publikationsrecht: Weiterverarbeitung und Publikation unter Quellenangabe gestattet."}]
[]
[{"$f":"Codierung!$I$154","v":"Zurück zum Inhaltsverzeichnis"}]
[]
[null,null,{"$f":"Codierung!$I$252&'D.2.1 Imp.n.H.'!$A$16&\"-\"&'D.2.1 Imp.n.H.'!$A$19","v":"Ø 2002-2005"},{"$f":"Codierung!$I$252&'D.2.1 Imp.n.H.'!$A$20&\"-\"&'D.2.1 Imp.n.H.'!$A$24","v":"Ø 2006-2010"},{"$f":"'D.2.1 Imp.n.H.'!$A$35","v":2021},{"$f":"'D.2.1 Imp.n.H.'!$A$36","v":2022},{"$f":"Codierung!$I$237&\" \"&C13","v":"%-∆ Ø 2002-2005"},{"$f":"Codierung!$I$237&\" \"&D13","v":"%-∆ Ø 2006-2010"},{"$f":"Codierung!$I$234","v":"%-∆ VM"}]
[]
[{"$f":"Codierung!$I$40","v":"Konsumeier"},{"$f":"Codierung!$I$198","v":"Niederlande"},{"$f":"IFERROR(AVERAGE('D.2.1 Imp.n.H.'!$B$16:$B$19),\"-\")","v":53.933441500000001},{"$f":"IFERROR(AVERAGE('D.2.1 Imp.n.H.'!$B$20:$B$24),\"-\")","v":115.12078751999999},{"$f":"IFERROR('D.2.1 Imp.n.H.'!$B$35,\"-\")","v":173.23588107000003},{"$f":"IFERROR('D.2.1 Imp.n.H.'!$B$36,\"-\")","v":209.75133482799995},{"$f":"IFERROR((F15-C15)/C15*100,\"-\")","v":288.90775184075721},{"$f":"IFERROR((F15-D15)/D15*100,\"-\")","v":82.201094473541332},{"$f":"IFERROR((F15-E15)/E15*100,\"-\")","v":21.078458765274494}]
[null,{"$f":"Codierung!$I$188","v":"Deutschland"},{"$f":"IFERROR(AVERAGE('D.2.1 Imp.n.H.'!$C$16:$C$19),\"-\")","v":83.892038350000007},{"$f":"IFERROR(AVERAGE('D.2.1 Imp.n.H.'!$C$20:$C$24),\"-\")","v":46.526167919999999},{"$f":"IFERROR('D.2.1 Imp.n.H.'!$C$35,\"-\")","v":67.609911999000005},{"$f":"IFERROR('D.2.1 Imp.n.H.'!$C$36,\"-\")","v":17.485907222999998},{"$f":"IFERROR((F16-C16)/C16*100,\"-\")","v":-79.156654711322787},{"$f":"IFERROR((F16-D16)/D16*100,\"-\")","v":-62.417048287608047},{"$f":"IFERROR((F16-E16)/E16*100,\"-\")","v":-74.13706554852692}]
[null,{"$f":"Codierung!$I$189","v":"Frankreich"},{"$f":"IFERROR(AVERAGE('D.2.1 Imp.n.H.'!$D$16:$D$19),\"-\")","v":78.396487999999991},{"$f":"IFERROR(AVERAGE('D.2.1 Imp.n.H.'!$D$20:$D$24),\"-\")","v":73.332531840000001},{"$f":"IFERROR('D.2.1 Imp.n.H.'!$D$35,\"-\")","v":21.469935243800002},{"$f":"IFERROR('D.2.1 Imp.n.H.'!$D$36,\"-\")","v":21.142318722799999},-73.031548654577477,-71.169250273631363,-1.5259315749199138]
[null,{"$f":"Codierung!$I$200","v":"Polen"},{"$f":"IFERROR(AVERAGE('D.2.1 Imp.n.H.'!$E$16:$E$19),\"-\")","v":1.6771934499999999},{"$f":"IFERROR(AVERAGE('D.2.1 Imp.n.H.'!$E$20:$E$24),\"-\")","v":0},{"$f":"IFERROR('D.2.1 Imp.n.H.'!$E$35,\"-\")","v":7.1218614800000006},{"$f":"IFERROR('D.2.1 Imp.n.H.'!$E$36,\"-\")","v":2.5209477120000003},50.307509965532034,"-",-64.602685420385342]
[null,{"$f":"Codierung!$I$191","v":"Italien"},{"$f":"IFERROR(AVERAGE('D.2.1 Imp.n.H.'!$F$16:$F$19),\"-\")","v":1.9794379500000001},{"$f":"IFERROR(AVERAGE('D.2.1 Imp.n.H.'!$F$20:$F$24),\"-\")","v":7.704455079999998},{"$f":"IFERROR('D.2.1 Imp.n.H.'!$F$35,\"-\")","v":1.6653717932000001},{"$f":"IFERROR('D.2.1 Imp.n.H.'!$F$36,\"-\")","v":1.5101846182000003},{"$f":"IFERROR((F19-C19)/C19*100,\"-\")","v":-23.706392605032143},{"$f":"IFERROR((F19-D19)/D19*100,\"-\")","v":-80.398553791035923},{"$f":"IFERROR((F19-E19)/E19*100,\"-\")","v":-9.3184702439212526}]
[null,{"$f":"Codierung!$I$202","v":"Rest"},{"$f":"IFERROR(AVERAGE('D.2.1 Imp.n.H.'!$G$16:$G$19),\"-\")","v":8.3070010500000109},{"$f":"IFERROR(AVERAGE('D.2.1 Imp.n.H.'!$G$20:$G$24),\"-\")","v":1.4550165599999607},{"$f":"IFERROR('D.2.1 Imp.n.H.'!$G$35,\"-\")","v":15.286069512599946},{"$f":"IFERROR('D.2.1 Imp.n.H.'!$G$36,\"-\")","v":12.490064996399969},50.355885610486986,758.41394110320675,-18.291193258641776]
[]
[{"$f":"Codierung!$I$41","v":"Verarbeitungseier"},{"$f":"Codierung!$I$198","v":"Niederlande"},{"$f":"IFERROR(AVERAGE('D.2.1 Imp.n.H.'!$H$16:$H$19),\"-\")","v":41.444925350000005},{"$f":"IFERROR(AVERAGE('D.2.1 Imp.n.H.'!$H$20:$H$24),\"-\")","v":75.507872199999994},{"$f":"IFERROR('D.2.1 Imp.n.H.'!$H$35,\"-\")","v":68.594451939999999},{"$f":"IFERROR('D.2.1 Imp.n.H.'!$H$36,\"-\")","v":52.822893200000003},{"$f":"IFERROR((F22-C22)/C22*100,\"-\")","v":27.453223172472178},{"$f":"IFERROR((F22-D22)/D22*100,\"-\")","v":-30.043197270760853},{"$f":"IFERROR((F22-E22)/E22*100,\"-\")","v":-22.992469935900179}]
[null,{"$f":"Codierung!$I$188","v":"Deutschland"},{"$f":"IFERROR(AVERAGE('D.2.1 Imp.n.H.'!$I$16:$I$19),\"-\")","v":70.862714949999997},{"$f":"IFERROR(AVERAGE('D.2.1 Imp.n.H.'!$I$20:$I$24),\"-\")","v":113.01955288000002},{"$f":"IFERROR('D.2.1 Imp.n.H.'!$I$35,\"-\")","v":21.298206201999999},{"$f":"IFERROR('D.2.1 Imp.n.H.'!$I$36,\"-\")","v":17.284226602},-75.608856343994759,-84.706870482533446,{"$f":"IFERROR((F23-E23)/E23*100,\"-\")","v":-18.846561827460697}]
[null,{"$f":"Codierung!$I$201","v":"Bulgarien"},{"$f":"IFERROR(AVERAGE('D.2.1 Imp.n.H.'!$J$16:$J$19),\"-\")","v":36.770655849999997},{"$f":"IFERROR(AVERAGE('D.2.1 Imp.n.H.'!$J$20:$J$24),\"-\")","v":20.982595879999998},{"$f":"IFERROR('D.2.1 Imp.n.H.'!$J$35,\"-\")","v":20.377739953599995},{"$f":"IFERROR('D.2.1 Imp.n.H.'!$J$36,\"-\")","v":5.7816807319999999},-84.276373106899598,-72.445350589290385,{"$f":"IFERROR((F24-E24)/E24*100,\"-\")","v":-71.627468280757071}]
[null,{"$f":"Codierung!$I$189","v":"Frankreich"},{"$f":"IFERROR(AVERAGE('D.2.1 Imp.n.H.'!$K$16:$K$19),\"-\")","v":10.1117489},{"$f":"IFERROR(AVERAGE('D.2.1 Imp.n.H.'!$K$20:$K$24),\"-\")","v":20.824925760000003},{"$f":"IFERROR('D.2.1 Imp.n.H.'!$K$35,\"-\")","v":0.12974560000000002},{"$f":"IFERROR('D.2.1 Imp.n.H.'!$K$36,\"-\")","v":0},-100,-100,{"$f":"IFERROR((F25-E25)/E25*100,\"-\")","v":-100}]
[null,{"$f":"Codierung!$I$200","v":"Polen"},{"$f":"IFERROR(AVERAGE('D.2.1 Imp.n.H.'!$L$16:$L$19),\"-\")","v":10.037400266666666},{"$f":"IFERROR(AVERAGE('D.2.1 Imp.n.H.'!$L$20:$L$24),\"-\")","v":9.5636307333333335},{"$f":"IFERROR('D.2.1 Imp.n.H.'!$L$35,\"-\")","v":0},{"$f":"IFERROR('D.2.1 Imp.n.H.'!$L$36,\"-\")","v":0.3331288},-96.681124682191935,-96.516712017760113,{"$f":"IFERROR((F26-E26)/E26*100,\"-\")","v":"-"}]
[null,{"$f":"Codierung!$I$202","v":"Rest"},{"$f":"IFERROR(AVERAGE('D.2.1 Imp.n.H.'!$M$16:$M$19),\"-\")","v":33.922564799999989},{"$f":"IFERROR(AVERAGE('D.2.1 Imp.n.H.'!$M$20:$M$24),\"-\")","v":18.343730400000027},{"$f":"IFERROR('D.2.1 Imp.n.H.'!$M$35,\"-\")","v":16.048795837999954},{"$f":"IFERROR('D.2.1 Imp.n.H.'!$M$36,\"-\")","v":17.942019861999988},-47.108893540974258,-2.1899064652631295,11.796673364847122]
[]
[{"$f":"Codierung!$I$37","v":"Eiprodukte"},{"$f":"Codierung!$I$198","v":"Niederlande"},{"$f":"IFERROR(AVERAGE('D.2.1 Imp.n.H.'!$N$16:$N$19),\"-\")","v":94.463943760000006},{"$f":"IFERROR(AVERAGE('D.2.1 Imp.n.H.'!$N$20:$N$24),\"-\")","v":94.389619179999983},{"$f":"IFERROR('D.2.1 Imp.n.H.'!$N$35,\"-\")","v":83.427017661999997},{"$f":"IFERROR('D.2.1 Imp.n.H.'!$N$36,\"-\")","v":89.196105500740003},{"$f":"IFERROR((F29-C29)/C29*100,\"-\")","v":-5.5765597428832168},{"$f":"IFERROR((F29-D29)/D29*100,\"-\")","v":-5.5022085313809823},{"$f":"IFERROR((F29-E29)/E29*100,\"-\")","v":6.9151313332488407}]
[null,{"$f":"Codierung!$I$188","v":"Deutschland"},{"$f":"IFERROR(AVERAGE('D.2.1 Imp.n.H.'!$O$16:$O$19),\"-\")","v":54.052262789999986},{"$f":"IFERROR(AVERAGE('D.2.1 Imp.n.H.'!$O$20:$O$24),\"-\")","v":27.750260731999997},{"$f":"IFERROR('D.2.1 Imp.n.H.'!$O$35,\"-\")","v":44.041592995999991},{"$f":"IFERROR('D.2.1 Imp.n.H.'!$O$36,\"-\")","v":48.639495346899992},-10.013951615919012,75.275813862216197,10.439909272395296]
[null,{"$f":"Codierung!$I$191","v":"Italien"},{"$f":"IFERROR(AVERAGE('D.2.1 Imp.n.H.'!$P$16:$P$19),\"-\")","v":17.879566875000002},{"$f":"IFERROR(AVERAGE('D.2.1 Imp.n.H.'!$P$20:$P$24),\"-\")","v":15.184180792000001},{"$f":"IFERROR('D.2.1 Imp.n.H.'!$P$35,\"-\")","v":10.054078289879998},{"$f":"IFERROR('D.2.1 Imp.n.H.'!$P$36,\"-\")","v":6.2798839704000002},-64.876755604293692,-58.641930991044013,-37.538939032123302]
[null,{"$f":"Codierung!$I$199","v":"Belgien"},{"$f":"IFERROR(AVERAGE('D.2.1 Imp.n.H.'!$Q$16:$Q$19),\"-\")","v":4.7396692399999996},{"$f":"IFERROR(AVERAGE('D.2.1 Imp.n.H.'!$Q$20:$Q$24),\"-\")","v":7.1884840360000002},{"$f":"IFERROR('D.2.1 Imp.n.H.'!$Q$35,\"-\")","v":7.0935831783599994},{"$f":"IFERROR('D.2.1 Imp.n.H.'!$Q$36,\"-\")","v":8.2894482467999993},74.895078686967622,15.31566607488254,16.858406229564757]
[null,{"$f":"Codierung!$I$189","v":"Frankreich"},{"$f":"IFERROR(AVERAGE('D.2.1 Imp.n.H.'!$R$16:$R$19),\"-\")","v":26.837244534999996},{"$f":"IFERROR(AVERAGE('D.2.1 Imp.n.H.'!$R$20:$R$24),\"-\")","v":8.6260571840000004},{"$f":"IFERROR('D.2.1 Imp.n.H.'!$R$35,\"-\")","v":12.30479053024},{"$f":"IFERROR('D.2.1 Imp.n.H.'!$R$36,\"-\")","v":12.897572374660001},{"$f":"IFERROR((F34-C34)/C34*100,\"-\")","v":-62.463730268997352},{"$f":"IFERROR((F34-D34)/D34*100,\"-\")","v":-60.455779229709762},{"$f":"IFERROR((F34-E34)/E34*100,\"-\")","v":-6.3745599670370687}]
[null,{"$f":"Codierung!$I$202","v":"Rest"},{"$f":"IFERROR(AVERAGE('D.2.1 Imp.n.H.'!$S$16:$S$19),\"-\")","v":14.259234965000019},{"$f":"IFERROR(AVERAGE('D.2.1 Imp.n.H.'!$S$20:$S$24),\"-\")","v":13.53518869200002},{"$f":"IFERROR('D.2.1 Imp.n.H.'!$S$35,\"-\")","v":5.7168061331999303},{"$f":"IFERROR('D.2.1 Imp.n.H.'!$S$36,\"-\")","v":5.3523848980398476},-62.463730268997352,-60.455779229709762,-6.3745599670370687]
[]
[{"$f":"Codierung!$I$49","v":"Bruteier"},{"$f":"Codierung!$I$189","v":"Frankreich"},{"$f":"IFERROR(AVERAGE('D.2.1 Imp.n.H.'!$T$16:$T$19),\"-\")","v":5.5556506500000005},{"$f":"IFERROR(AVERAGE('D.2.1 Imp.n.H.'!$T$20:$T$24),\"-\")","v":13.614280840000001},{"$f":"IFERROR('D.2.1 Imp.n.H.'!$T$35,\"-\")","v":14.346919184000001},{"$f":"IFERROR('D.2.1 Imp.n.H.'!$T$36,\"-\")","v":14.267766399999999},{"$f":"IFERROR((F36-C36)/C36*100,\"-\")","v":156.81539929081029},{"$f":"IFERROR((F36-D36)/D36*100,\"-\")","v":4.8000005852677727},{"$f":"IFERROR((F36-E36)/E36*100,\"-\")","v":-0.55170579122153551}]
[null,{"$f":"Codierung!$I$188","v":"Deutschland"},{"$f":"IFERROR(AVERAGE('D.2.1 Imp.n.H.'!$U$16:$U$19),\"-\")","v":1.2037822},{"$f":"IFERROR(AVERAGE('D.2.1 Imp.n.H.'!$U$20:$U$24),\"-\")","v":0.70968320000000007},{"$f":"IFERROR('D.2.1 Imp.n.H.'!$U$35,\"-\")","v":13.731361802},{"$f":"IFERROR('D.2.1 Imp.n.H.'!$U$36,\"-\")","v":13.965676778000001},1060.1497993573921,1867.8747894835328,1.7064219804176439]
[null,{"$f":"Codierung!$I$192","v":"Dänemark"},{"$f":"IFERROR(AVERAGE('D.2.1 Imp.n.H.'!$V$16:$V$19),\"-\")","v":"-"},{"$f":"IFERROR(AVERAGE('D.2.1 Imp.n.H.'!$V$20:$V$24),\"-\")","v":2.2443310666666663},{"$f":"IFERROR('D.2.1 Imp.n.H.'!$V$35,\"-\")","v":13.496596800000001},{"$f":"IFERROR('D.2.1 Imp.n.H.'!$V$36,\"-\")","v":13.629529600000001},"-",507.28694631683294,0.98493569875333853]
[null,{"$f":"Codierung!$I$198","v":"Niederlande"},{"$f":"IFERROR(AVERAGE('D.2.1 Imp.n.H.'!$W$16:$W$19),\"-\")","v":0.45716953333333338},{"$f":"IFERROR(AVERAGE('D.2.1 Imp.n.H.'!$W$20:$W$24),\"-\")","v":8.3502415599999988},{"$f":"IFERROR('D.2.1 Imp.n.H.'!$W$35,\"-\")","v":5.0290944999999994},{"$f":"IFERROR('D.2.1 Imp.n.H.'!$W$36,\"-\")","v":6.2320715999999994},1263.1861149102524,-25.366571071987043,23.920351864535458]
[null,{"$f":"Codierung!$I$190","v":"Österreich"},{"$f":"IFERROR(AVERAGE('D.2.1 Imp.n.H.'!$X$16:$X$19),\"-\")","v":"-"},{"$f":"IFERROR(AVERAGE('D.2.1 Imp.n.H.'!$X$20:$X$24),\"-\")","v":"-"},{"$f":"IFERROR('D.2.1 Imp.n.H.'!$X$35,\"-\")","v":""},{"$f":"IFERROR('D.2.1 Imp.n.H.'!$X$36,\"-\")","v":0.49619059999999998},"-","-","-"]
[null,{"$f":"Codierung!$I$202","v":"Rest"},{"$f":"IFERROR(AVERAGE('D.2.1 Imp.n.H.'!$Y$16:$Y$19),\"-\")","v":6.5636399999999748E-2},{"$f":"IFERROR(AVERAGE('D.2.1 Imp.n.H.'!$Y$20:$Y$24),\"-\")","v":0.10256586666666841},{"$f":"IFERROR('D.2.1 Imp.n.H.'!$Y$35,\"-\")","v":0.1278133599999845},{"$f":"IFERROR('D.2.1 Imp.n.H.'!$Y$36,\"-\")","v":0.12943567800001801},{"$f":"IFERROR((F41-C41)/C41*100,\"-\")","v":97.201062215506198},{"$f":"IFERROR((F41-D41)/D41*100,\"-\")","v":26.197615451029666},{"$f":"IFERROR((F41-E41)/E41*100,\"-\")","v":1.2692867162194226}]

{"sheet":"2.2 Imp.n.Kont.","index":3,"n_rows":30,"n_cols":9,"rows_kept":30,"cut":false,"hidden":false,"merged":[[27,0,29,0],[23,0,25,0],[19,0,21,0],[15,0,17,0]]}
[null,null,null,null,null,{"$f":"Codierung!I184","v":"Eidgenössisches Departement für  Wirtschaft, Bildung und Forschung WBF"}]
[null,null,null,null,null,{"$f":"Codierung!I185","v":"Bundesamt für Landwirtschaft BLW"}]
[null,null,null,null,null,{"$f":"Codierung!I186","v":"Fachbereich Marktanalysen"}]
[]
[null,null,null,null,null,{"$f":"Codierung!I242","v":"Anmerkungen:"}]
[{"$f":"Codierung!$I$172","v":"Auslastung der Importkontingente"},null,null,null,null,{"$f":"Codierung!I259","v":"Die Zollkontingente beziehen sich auf Brutto-Mengen"}]
[{"$f":"Codierung!$I$219","v":"in Tonnen"},null,null,null,"(2)",{"$f":"Codierung!I380","v":"Das BLW hat auf Anträgen der Branche das Kontingent für Konsumeierimporte um insgesamt 3'500 Tonnen erhöht infolge der hohen Nachfrage nach Schaleneiern wegen des vermehrten pandemiebedingten Konsums zu Hause"}]
[{"$f":"Codierung!$I$224","v":"in %"},null,null,null,"(3)",{"$f":"Codierung!I381","v":"Die Überschreitung der Kontingentsmenge ist möglich."}]
[{"$f":"Codierung!$I$206","v":"Quellen: BLW, Fachbereich Marktanalysen; EZV"}]
[{"$f":"Codierung!I215","v":"Publikationsrecht: Weiterverarbeitung und Publikation unter Quellenangabe gestattet."},null,null,null,null,{"$f":"Codierung!$I$256","v":"Aufbereitete Grafiken unterhalb der Datentabellen"}]
[]
[{"$f":"Codierung!$I$154","v":"Zurück zum Inhaltsverzeichnis"}]
[]
[null,null,{"$f":"Codierung!$I$252&'D.2.2 Imp.n.Kont.'!$A$16&\"-\"&'D.2.2 Imp.n.Kont.'!$A$19","v":"Ø 2002-2005"},{"$f":"Codierung!$I$252&'D.2.2 Imp.n.Kont.'!$A$20&\"-\"&'D.2.2 Imp.n.Kont.'!$A$24","v":"Ø 2006-2010"},{"$f":"'D.2.2 Imp.n.Kont.'!$A$35","v":"(2) 2021"},{"$f":"'D.2.2 Imp.n.Kont.'!$A$36","v":2022},{"$f":"Codierung!$I$237&\" \"&C14","v":"%-∆ Ø 2002-2005"},{"$f":"Codierung!$I$237&\" \"&D14","v":"%-∆ Ø 2006-2010"},{"$f":"Codierung!$I$233","v":"%-∆ Vorjahr"}]
[]
[{"$f":"Codierung!$I$40","v":"Konsumeier"},{"$f":"Codierung!$I$50","v":"Kontingentsmenge"},{"$f":"IFERROR(AVERAGE('D.2.2 Imp.n.Kont.'!$B$16:$B$19),\"-\")","v":18678},{"$f":"IFERROR(AVERAGE('D.2.2 Imp.n.Kont.'!$B$20:$B$24),\"-\")","v":16628},{"$f":"IFERROR('D.2.2 Imp.n.Kont.'!$B$35,\"-\")","v":20928},{"$f":"IFERROR('D.2.2 Imp.n.Kont.'!$B$36,\"-\")","v":17428},{"$f":"IFERROR((F16-C16)/C16*100,\"-\")","v":-6.6923653496091653},{"$f":"IFERROR((F16-D16)/D16*100,\"-\")","v":4.8111618955977864},{"$f":"IFERROR((F16-E16)/E16*100,\"-\")","v":-16.724006116207953}]
[null,{"$f":"Codierung!$I$51","v":"Zugeteilte / Eingeführte Menge"},{"$f":"IFERROR(AVERAGE('D.2.2 Imp.n.Kont.'!$C$16:$C$19),\"-\")","v":14687.38925},{"$f":"IFERROR(AVERAGE('D.2.2 Imp.n.Kont.'!$C$20:$C$24),\"-\")","v":16055.216092000002},{"$f":"IFERROR('D.2.2 Imp.n.Kont.'!$C$35,\"-\")","v":19057.52},{"$f":"IFERROR('D.2.2 Imp.n.Kont.'!$C$36,\"-\")","v":17428},{"$f":"IFERROR((F17-C17)/C17*100,\"-\")","v":18.659618148269612},{"$f":"IFERROR((F17-D17)/D17*100,\"-\")","v":8.5503919731359375},{"$f":"IFERROR((F17-E17)/E17*100,\"-\")","v":-8.5505354316826132}]
[null,{"$f":"Codierung!$I$52","v":"Auslastung"},{"$f":"IFERROR(AVERAGE('D.2.2 Imp.n.Kont.'!$D$16:$D$19),\"-\")","v":0.7912128622861464},{"$f":"IFERROR(AVERAGE('D.2.2 Imp.n.Kont.'!$D$20:$D$24),\"-\")","v":0.96589529842665767},{"$f":"IFERROR('D.2.2 Imp.n.Kont.'!$D$35,\"-\")","v":0.91062308868501529},{"$f":"IFERROR('D.2.2 Imp.n.Kont.'!$D$36,\"-\")","v":1},{"$f":"IFERROR((F18-C18)/C18*100,\"-\")","v":26.388238572181429},{"$f":"IFERROR((F18-D18)/D18*100,\"-\")","v":3.5308901108531452},{"$f":"IFERROR((F18-E18)/E18*100,\"-\")","v":9.8149182055167721}]
[]
[{"$f":"Codierung!$I$41","v":"Verarbeitungseier"},{"$f":"Codierung!$I$50","v":"Kontingentsmenge"},{"$f":"IFERROR(AVERAGE('D.2.2 Imp.n.Kont.'!$E$16:$E$19),\"-\")","v":15057},{"$f":"IFERROR(AVERAGE('D.2.2 Imp.n.Kont.'!$E$20:$E$24),\"-\")","v":17907},{"$f":"IFERROR('D.2.2 Imp.n.Kont.'!$E$35,\"-\")","v":16307},{"$f":"IFERROR('D.2.2 Imp.n.Kont.'!$E$36,\"-\")","v":16307},{"$f":"IFERROR((F20-C20)/C20*100,\"-\")","v":8.3017865444643686},{"$f":"IFERROR((F20-D20)/D20*100,\"-\")","v":-8.935053331099569},{"$f":"IFERROR((F20-E20)/E20*100,\"-\")","v":0}]
[null,{"$f":"Codierung!$I$51","v":"Zugeteilte / Eingeführte Menge"},{"$f":"IFERROR(AVERAGE('D.2.2 Imp.n.Kont.'!$F$16:$F$19),\"-\")","v":12674.56925},{"$f":"IFERROR(AVERAGE('D.2.2 Imp.n.Kont.'!$F$20:$F$24),\"-\")","v":16213.1266},{"$f":"IFERROR('D.2.2 Imp.n.Kont.'!$F$35,\"-\")","v":8906.09},{"$f":"IFERROR('D.2.2 Imp.n.Kont.'!$F$36,\"-\")","v":6345.2159000000001},{"$f":"IFERROR((F21-C21)/C21*100,\"-\")","v":-49.937423711657893},{"$f":"IFERROR((F21-D21)/D21*100,\"-\")","v":-60.863712123237235},{"$f":"IFERROR((F21-E21)/E21*100,\"-\")","v":-28.754190671776282}]
[null,{"$f":"Codierung!$I$52","v":"Auslastung"},{"$f":"IFERROR(AVERAGE('D.2.2 Imp.n.Kont.'!$G$16:$G$19),\"-\")","v":0.84429068390083528},{"$f":"IFERROR(AVERAGE('D.2.2 Imp.n.Kont.'!$G$20:$G$24),\"-\")","v":0.90626245780523895},{"$f":"IFERROR('D.2.2 Imp.n.Kont.'!$G$35,\"-\")","v":0.54615134604770954},{"$f":"IFERROR('D.2.2 Imp.n.Kont.'!$G$36,\"-\")","v":0.38910994664867848},{"$f":"IFERROR((F22-C22)/C22*100,\"-\")","v":-53.91279874712194},{"$f":"IFERROR((F22-D22)/D22*100,\"-\")","v":-57.064320242172009},{"$f":"IFERROR((F22-E22)/E22*100,\"-\")","v":-28.754190671776275}]
[]
[{"$f":"Codierung!$I$44","v":"Eiprodukte getrocknet"},{"$f":"Codierung!$I$50","v":"Kontingentsmenge"},{"$f":"IFERROR(AVERAGE('D.2.2 Imp.n.Kont.'!$H$16:$H$19),\"-\")","v":977},{"$f":"IFERROR(AVERAGE('D.2.2 Imp.n.Kont.'!$H$20:$H$24),\"-\")","v":977},{"$f":"IFERROR('D.2.2 Imp.n.Kont.'!$H$35,\"-\")","v":977},{"$f":"IFERROR('D.2.2 Imp.n.Kont.'!$H$36,\"-\")","v":977},{"$f":"IFERROR((F24-C24)/C24*100,\"-\")","v":0},{"$f":"IFERROR((F24-D24)/D24*100,\"-\")","v":0},{"$f":"IFERROR((F24-E24)/E24*100,\"-\")","v":0}]
[null,{"$f":"Codierung!$I$51","v":"Zugeteilte / Eingeführte Menge"},{"$f":"IFERROR(AVERAGE('D.2.2 Imp.n.Kont.'!$I$16:$I$19),\"-\")","v":738.96400000000006},{"$f":"IFERROR(AVERAGE('D.2.2 Imp.n.Kont.'!$I$20:$I$24),\"-\")","v":761.2124},{"$f":"IFERROR('D.2.2 Imp.n.Kont.'!$I$35,\"-\")","v":481.666},{"$f":"IFERROR('D.2.2 Imp.n.Kont.'!$I$36,\"-\")","v":680.23},{"$f":"IFERROR((F25-C25)/C25*100,\"-\")","v":-7.9481544432475779},{"$f":"IFERROR((F25-D25)/D25*100,\"-\")","v":-10.638607568662831},{"$f":"IFERROR((F25-E25)/E25*100,\"-\")","v":41.224416919608196}]
[null,{"$f":"Codierung!$I$52","v":"Auslastung"},{"$f":"IFERROR(AVERAGE('D.2.2 Imp.n.Kont.'!$J$16:$J$19),\"-\")","v":0.75636028659160703},{"$f":"IFERROR(AVERAGE('D.2.2 Imp.n.Kont.'!$J$20:$J$24),\"-\")","v":0.77913244626407363},{"$f":"IFERROR('D.2.2 Imp.n.Kont.'!$J$35,\"-\")","v":0.49300511770726713},{"$f":"IFERROR('D.2.2 Imp.n.Kont.'!$J$36,\"-\")","v":0.69624360286591602},{"$f":"IFERROR((F26-C26)/C26*100,\"-\")","v":-7.9481544432475886},{"$f":"IFERROR((F26-D26)/D26*100,\"-\")","v":-10.638607568662833},{"$f":"IFERROR((F26-E26)/E26*100,\"-\")","v":41.224416919608188}]
[]
[{"$f":"Codierung!$I$43","v":"Eiprodukte flüssig"},{"$f":"Codierung!$I$50","v":"Kontingentsmenge"},{"$f":"IFERROR(AVERAGE('D.2.2 Imp.n.Kont.'!$K$16:$K$19),\"-\")","v":6866},{"$f":"IFERROR(AVERAGE('D.2.2 Imp.n.Kont.'!$K$20:$K$24),\"-\")","v":6866},{"$f":"IFERROR('D.2.2 Imp.n.Kont.'!$K$35,\"-\")","v":6866},{"$f":"IFERROR('D.2.2 Imp.n.Kont.'!$K$36,\"-\")","v":6866},{"$f":"IFERROR((F28-C28)/C28*100,\"-\")","v":0},{"$f":"IFERROR((F28-D28)/D28*100,\"-\")","v":0},{"$f":"IFERROR((F28-E28)/E28*100,\"-\")","v":0}]
[null,{"$f":"Codierung!$I$51","v":"Zugeteilte / Eingeführte Menge"},{"$f":"IFERROR(AVERAGE('D.2.2 Imp.n.Kont.'!$L$16:$L$19),\"-\")","v":7960.7627499999999},{"$f":"IFERROR(AVERAGE('D.2.2 Imp.n.Kont.'!$L$20:$L$24),\"-\")","v":5484.6171999999988},{"$f":"IFERROR('D.2.2 Imp.n.Kont.'!$L$35,\"-\")","v":6625.4219999999996},{"$f":"IFERROR('D.2.2 Imp.n.Kont.'!$L$36,\"-\")","v":10294.475199999999},{"$f":"IFERROR((F29-C29)/C29*100,\"-\")","v":29.315186537872883},{"$f":"IFERROR((F29-D29)/D29*100,\"-\")","v":87.697241659819042},{"$f":"IFERROR((F29-E29)/E29*100,\"-\")","v":55.378407594263422}]
[null,{"$f":"Codierung!$I$52","v":"Auslastung"},{"$f":"IFERROR(AVERAGE('D.2.2 Imp.n.Kont.'!$M$16:$M$19),\"-\")","v":1.1594469487328867},{"$f":"IFERROR(AVERAGE('D.2.2 Imp.n.Kont.'!$M$20:$M$24),\"-\")","v":0.79880821438974658},{"$f":"IFERROR('D.2.2 Imp.n.Kont.'!$M$35,\"-\")","v":0.96496096708418289},{"$f":"IFERROR('D.2.2 Imp.n.Kont.'!$M$36,\"-\")","v":1.4993409845616079},{"$f":"IFERROR((F30-C30)/C30*100,\"-\")","v":29.315186537872894},{"$f":"IFERROR((F30-D30)/D30*100,\"-\")","v":87.697241659819028},55.378407594263436]

{"sheet":"2.3 aVV","index":4,"n_rows":27,"n_cols":10,"rows_kept":27,"cut":false,"hidden":false,"merged":[[20,0,26,0],[13,0,19,0],[23,1,25,1],[20,1,22,1],[16,1,18,1],[13,1,15,1]]}
[null,null,null,null,null,{"$f":"Codierung!I184","v":"Eidgenössisches Departement für  Wirtschaft, Bildung und Forschung WBF"}]
[null,null,null,null,null,{"$f":"Codierung!I185","v":"Bundesamt für Landwirtschaft BLW"}]
[null,null,null,null,null,{"$f":"Codierung!I186","v":"Fachbereich Marktanalysen"}]
[]
[null,null,null,null,null,{"$f":"Codierung!I242","v":"Anmerkungen:"}]
[{"$f":"Codierung!$I$174","v":"Aktiver Veredelungsverkehr (ohne Produkte für technische Zwecke)"},null,null,null,null,{"$f":"Codierung!I251","v":"Umrechnungsfaktoren: Eiprodukte getrocknet 80 Eier / kg; Eiprodukte flüssig 20.58 Eier / kg; Schaleneier 16.6 Eier / kg"}]
[{"$f":"Codierung!$I$222","v":"in Mio. Stück"}]
[{"$f":"Codierung!$I$206","v":"Quellen: BLW, Fachbereich Marktanalysen; EZV"}]
[{"$f":"Codierung!I215","v":"Publikationsrecht: Weiterverarbeitung und Publikation unter Quellenangabe gestattet."}]
[]
[{"$f":"Codierung!$I$154","v":"Zurück zum Inhaltsverzeichnis"}]
[{"$f":"Codierung!$I$253","v":"Informationen zur Methodik"},null,null,{"$f":"Codierung!$I$252&'D.2.3 aVV'!$A$16&\"-\"&'D.2.3 aVV'!$A$19","v":"Ø 2002-2005"},{"$f":"Codierung!$I$252&'D.2.3 aVV'!$A$20&\"-\"&'D.2.3 aVV'!$A$24","v":"Ø 2006-2010"},{"$f":"'D.2.3 aVV'!$A$35","v":2021},{"$f":"'D.2.3 aVV'!$A$36","v":2022},{"$f":"Codierung!$I$237&\" \"&D12","v":"%-∆ Ø 2002-2005"},{"$f":"Codierung!$I$237&\" \"&E12","v":"%-∆ Ø 2006-2010"},{"$f":"Codierung!$I$233","v":"%-∆ Vorjahr"}]
[]
[{"$f":"Codierung!$I$45","v":"Import"},{"$f":"Codierung!$I$28","v":"Schaleneier"},{"$f":"Codierung!$I$40","v":"Konsumeier"},{"$f":"IFERROR(AVERAGE('D.2.3 aVV'!$B$16:$B$19),\"-\")","v":"-"},{"$f":"IFERROR(AVERAGE('D.2.3 aVV'!$B$20:$B$24),\"-\")","v":"-"},{"$f":"IFERROR('D.2.3 aVV'!$B$35,\"-\")","v":8.9673863999999988},{"$f":"IFERROR('D.2.3 aVV'!$B$36,\"-\")","v":3.2614019999999999},{"$f":"IFERROR((G14-D14)/D14*100,\"-\")","v":"-"},{"$f":"IFERROR((G14-E14)/E14*100,\"-\")","v":"-"},{"$f":"IFERROR((G14-F14)/F14*100,\"-\")","v":-63.630406290956742}]
[null,null,{"$f":"Codierung!$I$41","v":"Verarbeitungseier"},{"$f":"IFERROR(AVERAGE('D.2.3 aVV'!$C$16:$C$19),\"-\")","v":3.3498260499999999},{"$f":"IFERROR(AVERAGE('D.2.3 aVV'!$C$20:$C$24),\"-\")","v":17.337049960000002},{"$f":"IFERROR('D.2.3 aVV'!$C$35,\"-\")","v":"-"},{"$f":"IFERROR('D.2.3 aVV'!$C$36,\"-\")","v":"-"},"-",{"$f":"IFERROR((G15-E15)/E15*100,\"-\")","v":"-"},{"$f":"IFERROR((G15-F15)/F15*100,\"-\")","v":"-"}]
[null,null,{"$f":"Codierung!$I$36","v":"Total"},{"$f":"IFERROR(AVERAGE('D.2.3 aVV'!$D$16:$D$19),\"-\")","v":3.3498260499999999},{"$f":"IFERROR(AVERAGE('D.2.3 aVV'!$D$20:$D$24),\"-\")","v":17.337049960000002},{"$f":"IFERROR('D.2.3 aVV'!$D$35,\"-\")","v":8.9673863999999988},{"$f":"IFERROR('D.2.3 aVV'!$D$36,\"-\")","v":3.2614019999999999},-2.6396609459765825,-81.188252860061553,-63.630406290956742]
[null,{"$f":"Codierung!$I$37","v":"Eiprodukte"},{"$f":"Codierung!$I$43","v":"Eiprodukte flüssig"},{"$f":"IFERROR(AVERAGE('D.2.3 aVV'!$E$16:$E$19),\"-\")","v":53.072743289999998},{"$f":"IFERROR(AVERAGE('D.2.3 aVV'!$E$20:$E$24),\"-\")","v":34.71286224},{"$f":"IFERROR('D.2.3 aVV'!$E$35,\"-\")","v":42.425937540000007},{"$f":"IFERROR('D.2.3 aVV'!$E$36,\"-\")","v":39.814150320000003},-24.981925086390227,14.695671145555192,-6.1561096146374128]
[null,null,{"$f":"Codierung!$I$44","v":"Eiprodukte getrocknet"},{"$f":"IFERROR(AVERAGE('D.2.3 aVV'!$F$16:$F$19),\"-\")","v":45.103380000000001},{"$f":"IFERROR(AVERAGE('D.2.3 aVV'!$F$20:$F$24),\"-\")","v":53.479024000000003},{"$f":"IFERROR('D.2.3 aVV'!$F$35,\"-\")","v":10.066000000000001},{"$f":"IFERROR('D.2.3 aVV'!$F$36,\"-\")","v":8.2560000000000002},-81.695385135216029,-84.562171516069554,-17.981323266441489]
[null,null,{"$f":"Codierung!$I$36","v":"Total"},{"$f":"IFERROR(AVERAGE('D.2.3 aVV'!$G$16:$G$19),\"-\")","v":98.176123290000007},{"$f":"IFERROR(AVERAGE('D.2.3 aVV'!$G$20:$G$24),\"-\")","v":88.191886240000002},{"$f":"IFERROR('D.2.3 aVV'!$G$35,\"-\")","v":52.491937540000009},{"$f":"IFERROR('D.2.3 aVV'!$G$36,\"-\")","v":48.070150320000003},-51.036821674036993,-45.493681596530507,-8.4237454878294535]
[null,{"$f":"Codierung!$I$36","v":"Total"},null,{"$f":"IFERROR(AVERAGE('D.2.3 aVV'!$H$16:$H$19),\"-\")","v":101.52594934000001},{"$f":"IFERROR(AVERAGE('D.2.3 aVV'!$H$20:$H$24),\"-\")","v":105.5289362},{"$f":"IFERROR('D.2.3 aVV'!$H$35,\"-\")","v":61.459323940000004},{"$f":"IFERROR('D.2.3 aVV'!$H$36,\"-\")","v":51.33155232},-49.439968152284017,-51.357841585064698,-16.478820414437518]
[{"$f":"Codierung!$I$54","v":"Re-Export"},{"$f":"Codierung!$I$28","v":"Schaleneier"},{"$f":"Codierung!$I$40","v":"Konsumeier"},{"$f":"IFERROR(AVERAGE('D.2.3 aVV'!$I$16:$I$19),\"-\")","v":"-"},{"$f":"IFERROR(AVERAGE('D.2.3 aVV'!$I$20:$I$24),\"-\")","v":0.1075348},{"$f":"IFERROR('D.2.3 aVV'!$I$35,\"-\")","v":1.5188999999999999E-2},{"$f":"IFERROR('D.2.3 aVV'!$I$36,\"-\")","v":"-"},"-","-","-"]
[null,null,{"$f":"Codierung!$I$41","v":"Verarbeitungseier"},{"$f":"IFERROR(AVERAGE('D.2.3 aVV'!$J$16:$J$19),\"-\")","v":"-"},{"$f":"IFERROR(AVERAGE('D.2.3 aVV'!$J$20:$J$24),\"-\")","v":"-"},{"$f":"IFERROR('D.2.3 aVV'!$J$35,\"-\")","v":"-"},{"$f":"IFERROR('D.2.3 aVV'!$J$36,\"-\")","v":"-"},"-","-","-"]
[null,null,{"$f":"Codierung!$I$36","v":"Total"},{"$f":"IFERROR(AVERAGE('D.2.3 aVV'!$K$16:$K$19),\"-\")","v":"-"},{"$f":"IFERROR(AVERAGE('D.2.3 aVV'!$K$20:$K$24),\"-\")","v":0.1075348},{"$f":"IFERROR('D.2.3 aVV'!$K$35,\"-\")","v":1.5188999999999999E-2},{"$f":"IFERROR('D.2.3 aVV'!$K$36,\"-\")","v":"-"},"-","-","-"]
[null,{"$f":"Codierung!$I$37","v":"Eiprodukte"},{"$f":"Codierung!$I$43","v":"Eiprodukte flüssig"},{"$f":"IFERROR(AVERAGE('D.2.3 aVV'!$L$16:$L$19),\"-\")","v":0.21716015999999999},{"$f":"IFERROR(AVERAGE('D.2.3 aVV'!$L$20:$L$24),\"-\")","v":1.8513644519999999},{"$f":"IFERROR('D.2.3 aVV'!$L$35,\"-\")","v":3.6463541100000003},{"$f":"IFERROR('D.2.3 aVV'!$L$36,\"-\")","v":5.0216640600000009},2212.4241849886284,171.24124883002781,37.717399586295265]
[null,null,{"$f":"Codierung!$I$44","v":"Eiprodukte getrocknet"},{"$f":"IFERROR(AVERAGE('D.2.3 aVV'!$M$16:$M$19),\"-\")","v":"-"},{"$f":"IFERROR(AVERAGE('D.2.3 aVV'!$M$20:$M$24),\"-\")","v":0.326432},{"$f":"IFERROR('D.2.3 aVV'!$M$35,\"-\")","v":"-"},{"$f":"IFERROR('D.2.3 aVV'!$M$36,\"-\")","v":"-"},"-","-","-"]
[null,null,{"$f":"Codierung!$I$36","v":"Total"},{"$f":"IFERROR(AVERAGE('D.2.3 aVV'!$N$16:$N$19),\"-\")","v":0.21716015999999999},{"$f":"IFERROR(AVERAGE('D.2.3 aVV'!$N$20:$N$24),\"-\")","v":2.1777964519999999},{"$f":"IFERROR('D.2.3 aVV'!$N$35,\"-\")","v":3.6463541100000003},{"$f":"IFERROR('D.2.3 aVV'!$N$36,\"-\")","v":5.0216640600000009},2212.4241849886284,130.58463776026031,37.717399586295265]
[null,{"$f":"Codierung!$I$36","v":"Total"},null,{"$f":"IFERROR(AVERAGE('D.2.3 aVV'!$O$16:$O$19),\"-\")","v":0.21716015999999999},{"$f":"IFERROR(AVERAGE('D.2.3 aVV'!$O$20:$O$24),\"-\")","v":2.2208103719999999},{"$f":"IFERROR('D.2.3 aVV'!$O$35,\"-\")","v":3.6615431100000002},{"$f":"IFERROR('D.2.3 aVV'!$O$36,\"-\")","v":5.0216640600000009},2212.4241849886284,126.11854318194806,37.146113240764237]

{"sheet":"2.4 Imp. LM","index":5,"n_rows":11,"n_cols":6,"rows_kept":11,"cut":false,"hidden":true,"merged":[]}
[null,null,null,null,null,{"$f":"Codierung!I184","v":"Eidgenössisches Departement für  Wirtschaft, Bildung und Forschung WBF"}]
[null,null,null,null,null,{"$f":"Codierung!I185","v":"Bundesamt für Landwirtschaft BLW"}]
[null,null,null,null,null,{"$f":"Codierung!I186","v":"Fachbereich Marktanalysen"}]
[]
[{"$f":"Codierung!$I$157","v":"\"Versteckte\" Eierimporte in Lebensmittelzubereitungen"}]
[{"$f":"Codierung!$I$222","v":"in Mio. Stück"}]
[{"$f":"Codierung!$I$224","v":"in %"}]
[{"$f":"Codierung!$I$223","v":"in Stück / Kopf"}]
[{"$f":"Codierung!$I$210","v":"Quellen: BLW, Fachbereich Marktanalysen; SBV; EZV; Aviforum"}]
[{"$f":"Codierung!$I$215","v":"Publikationsrecht: Weiterverarbeitung und Publikation unter Quellenangabe gestattet."}]
[{"$f":"Codierung!$I$154","v":"Zurück zum Inhaltsverzeichnis"}]

{"sheet":"3. MEM","index":6,"n_rows":32,"n_cols":10,"rows_kept":32,"cut":false,"hidden":false,"merged":[[25,0,27,0],[21,0,23,0],[18,0,19,0],[15,0,16,0]]}
[null,null,null,null,null,{"$f":"Codierung!I184","v":"Eidgenössisches Departement für  Wirtschaft, Bildung und Forschung WBF"}]
[null,null,null,null,null,{"$f":"Codierung!I185","v":"Bundesamt für Landwirtschaft BLW"}]
[null,null,null,null,null,{"$f":"Codierung!I186","v":"Fachbereich Marktanalysen"}]
[]
[]
[{"$f":"Codierung!I173","v":"Marktentlastungsmassnahmen "},null,null,null,null,{"$f":"Codierung!I242","v":"Anmerkungen:"}]
[{"$f":"Codierung!$I$220","v":"in Stück"},null,null,null,null,{"$f":"Codierung!I256","v":"Aufbereitete Grafiken unterhalb der Datentabellen"}]
[{"$f":"Codierung!$I$221","v":"in CHF"},null,null,null,"(1)",{"$f":"Codierung!I247","v":"Deckelung der ausbezahlten Mittel (rot markiert); Kürzung der Beiträge je Ei"}]
[{"$f":"Codierung!$I$217","v":"in CHF / Ei"}]
[{"$f":"Codierung!I205","v":"Quellen: BLW, Fachbereich Marktanalysen"}]
[{"$f":"Codierung!I215","v":"Publikationsrecht: Weiterverarbeitung und Publikation unter Quellenangabe gestattet."}]
[]
[{"$f":"Codierung!$I$154","v":"Zurück zum Inhaltsverzeichnis"}]
[{"$f":"Codierung!$I$253","v":"Informationen zur Methodik"},null,null,{"$f":"Codierung!$I$252&'D.3 MEM'!$A$18&\"-\"&'D.3 MEM'!$A$22","v":"Ø 2001-2005"},{"$f":"Codierung!$I$252&'D.3 MEM'!$A$23&\"-\"&'D.3 MEM'!$A$27","v":"Ø 2006-2010"},{"$f":"'D.3 MEM'!$A$38","v":"(1) 2021"},{"$f":"'D.3 MEM'!$A$39","v":"(1) 2022"},{"$f":"Codierung!$I$237&\" \"&D14","v":"%-∆ Ø 2001-2005"},{"$f":"Codierung!$I$237&\" \"&E14","v":"%-∆ Ø 2006-2010"},{"$f":"Codierung!$I$233","v":"%-∆ Vorjahr"}]
[]
[{"$f":"Codierung!$I$55","v":"Aufschlagsaktion"},{"$f":"Codierung!$I$60","v":"Beitrag"},{"$f":"Codierung!$I$217","v":"in CHF / Ei"},{"$f":"IFERROR(AVERAGE('D.3 MEM'!$B$18:$B$22),\"-\")","v":8.8999999999999996E-2},{"$f":"IFERROR(AVERAGE('D.3 MEM'!$B$23:$B$27),\"-\")","v":8.8960296511210485E-2},{"$f":"IFERROR('D.3 MEM'!$B$38,\"-\")","v":5.3952260234626903E-2},{"$f":"IFERROR('D.3 MEM'!$B$39,\"-\")","v":3.4343533881865201E-2},{"$f":"IFERROR((G16-D16)/D16*100,\"-\")","v":-61.411759683297532},{"$f":"IFERROR((G16-E16)/E16*100,\"-\")","v":-61.394537531091366},{"$f":"IFERROR((G16-F16)/F16*100,\"-\")","v":-36.344587358319231}]
[null,null,{"$f":"Codierung!$I$220","v":"in Stück"},{"$f":"IFERROR(AVERAGE('D.3 MEM'!$C$18:$C$22),\"-\")","v":15469106.800000001},{"$f":"IFERROR(AVERAGE('D.3 MEM'!$C$23:$C$27),\"-\")","v":12038883.6},{"$f":"IFERROR('D.3 MEM'!$C$38,\"-\")","v":27802357},{"$f":"IFERROR('D.3 MEM'!$C$39,\"-\")","v":43676344},{"$f":"IFERROR((G17-D17)/D17*100,\"-\")","v":182.34561028436366},{"$f":"IFERROR((G17-E17)/E17*100,\"-\")","v":262.7939720257782},{"$f":"IFERROR((G17-F17)/F17*100,\"-\")","v":57.095831839005598}]
[]
[{"$f":"Codierung!$I$56","v":"Verbilligungsaktion"},{"$f":"Codierung!$I$60","v":"Beitrag"},{"$f":"Codierung!$I$217","v":"in CHF / Ei"},{"$f":"IFERROR(AVERAGE('D.3 MEM'!$D$18:$D$22),\"-\")","v":0.05},{"$f":"IFERROR(AVERAGE('D.3 MEM'!$D$23:$D$27),\"-\")","v":4.8703356536481869E-2},{"$f":"IFERROR('D.3 MEM'!$D$38,\"-\")","v":3.9751758220266102E-2},{"$f":"IFERROR('D.3 MEM'!$D$39,\"-\")","v":4.1531247113578328E-2},{"$f":"IFERROR((G19-D19)/D19*100,\"-\")","v":-16.937505772843352},{"$f":"IFERROR((G19-E19)/E19*100,\"-\")","v":-14.726109108170359},4.4765036138829517]
[null,null,{"$f":"Codierung!$I$220","v":"in Stück"},{"$f":"IFERROR(AVERAGE('D.3 MEM'!$E$18:$E$22),\"-\")","v":11547350.4},{"$f":"IFERROR(AVERAGE('D.3 MEM'!$E$23:$E$27),\"-\")","v":13906887.199999999},{"$f":"IFERROR('D.3 MEM'!$E$38,\"-\")","v":12578060},{"$f":"IFERROR('D.3 MEM'!$E$39,\"-\")","v":12039128},{"$f":"IFERROR((G20-D20)/D20*100,\"-\")","v":4.258791696491687},-13.430461994399431,-4.284698912232888]
[]
[{"$f":"Codierung!$I$57","v":"Eingesetzte Mittel"},{"$f":"Codierung!$I$55","v":"Aufschlagsaktion"},{"$f":"Codierung!$I$221","v":"in CHF"},{"$f":"IFERROR(AVERAGE('D.3 MEM'!$F$18:$F$22),\"-\")","v":1384366.5679999997},{"$f":"IFERROR(AVERAGE('D.3 MEM'!$F$23:$F$27),\"-\")","v":1065108.8640000001},{"$f":"IFERROR('D.3 MEM'!$F$38,\"-\")","v":1500000.0000000009},{"$f":"IFERROR('D.3 MEM'!$F$39,\"-\")","v":1500000},{"$f":"IFERROR((G22-D22)/D22*100,\"-\")","v":8.3528044286027772},40.830674750632809,-6.2088171641031866E-14]
[null,{"$f":"Codierung!$I$56","v":"Verbilligungsaktion"},{"$f":"Codierung!$I$221","v":"in CHF"},{"$f":"IFERROR(AVERAGE('D.3 MEM'!$G$18:$G$22),\"-\")","v":577367.52000000014},{"$f":"IFERROR(AVERAGE('D.3 MEM'!$G$23:$G$27),\"-\")","v":680446.16},{"$f":"IFERROR('D.3 MEM'!$G$38,\"-\")","v":500000.00000000023},{"$f":"IFERROR('D.3 MEM'!$G$39,\"-\")","v":500000},{"$f":"IFERROR((G23-D23)/D23*100,\"-\")","v":-13.400047165798332},-26.518800546982295,-4.6566128730773903E-14]
[null,{"$f":"Codierung!$I$36","v":"Total"},{"$f":"Codierung!$I$221","v":"in CHF"},{"$f":"IFERROR(AVERAGE('D.3 MEM'!$H$18:$H$22),\"-\")","v":1961734.088},{"$f":"IFERROR(AVERAGE('D.3 MEM'!$H$23:$H$27),\"-\")","v":1745555.0240000002},{"$f":"IFERROR('D.3 MEM'!$H$38,\"-\")","v":2000000.0000000012},{"$f":"IFERROR('D.3 MEM'!$H$39,\"-\")","v":2000000},{"$f":"IFERROR((G24-D24)/D24*100,\"-\")","v":1.9506166627818728},14.576737627951154,-5.8207660913467371E-14]
[]
[{"$f":"Codierung!$I$58","v":"Maximal zur Verfügung stehende Bundesmittel"},{"$f":"Codierung!$I$55","v":"Aufschlagsaktion"},{"$f":"Codierung!$I$221","v":"in CHF"},{"$f":"IFERROR(AVERAGE('D.3 MEM'!$I$18:$I$22),\"-\")","v":"-"},"-",{"$f":"IFERROR('D.3 MEM'!$I$38,\"-\")","v":1500000},{"$f":"IFERROR('D.3 MEM'!$I$39,\"-\")","v":1500000},{"$f":"IFERROR((G26-D26)/D26*100,\"-\")","v":"-"},"-",{"$f":"IFERROR((G26-F26)/F26*100,\"-\")","v":0}]
[null,{"$f":"Codierung!$I$56","v":"Verbilligungsaktion"},{"$f":"Codierung!$I$221","v":"in CHF"},{"$f":"IFERROR(AVERAGE('D.3 MEM'!$J$18:$J$22),\"-\")","v":"-"},"-",{"$f":"IFERROR('D.3 MEM'!$J$38,\"-\")","v":500000},{"$f":"IFERROR('D.3 MEM'!$J$39,\"-\")","v":500000},{"$f":"IFERROR((G27-D27)/D27*100,\"-\")","v":"-"},"-",{"$f":"IFERROR((G27-F27)/F27*100,\"-\")","v":0}]
[null,{"$f":"Codierung!$I$36","v":"Total"},{"$f":"Codierung!$I$221","v":"in CHF"},{"$f":"IFERROR(AVERAGE('D.3 MEM'!$K$18:$K$22),\"-\")","v":2900000},{"$f":"IFERROR(AVERAGE('D.3 MEM'!$K$23:$K$27),\"-\")","v":2463000},{"$f":"IFERROR('D.3 MEM'!$K$38,\"-\")","v":2000000},{"$f":"IFERROR('D.3 MEM'!$K$39,\"-\")","v":2000000},{"$f":"IFERROR((G28-D28)/D28*100,\"-\")","v":-31.03448275862069},-18.798213560698336,0]
[]
[{"$f":"Codierung!$I$59","v":"Auslastung Mittel"},null,null,{"$f":"IFERROR(AVERAGE('D.3 MEM'!$L$18:$L$22),\"-\")","v":0.66848211253333323},{"$f":"IFERROR(AVERAGE('D.3 MEM'!$L$23:$L$27),\"-\")","v":0.73018779946714041},{"$f":"IFERROR('D.3 MEM'!$L$38,\"-\")","v":1.0000000000000007},{"$f":"IFERROR('D.3 MEM'!$L$39,\"-\")","v":1},{"$f":"IFERROR((G30-D30)/D30*100,\"-\")","v":49.592634006364072},36.951069400194982,-6.6613381477509355E-14]
[]
[{"$f":"Codierung!$I$61","v":"Anteil betroffene Eier an Inlandproduktion"},null,null,{"$f":"IFERROR(AVERAGE('D.3 MEM'!$M$18:$M$22),\"-\")","v":3.9968424808668489E-2},{"$f":"IFERROR(AVERAGE('D.3 MEM'!$M$23:$M$27),\"-\")","v":3.7081404930070713E-2},{"$f":"IFERROR('D.3 MEM'!$M$38,\"-\")","v":3.5254916255159759E-2},{"$f":"IFERROR('D.3 MEM'!$M$39,\"-\")","v":4.9099985459160098E-2},{"$f":"IFERROR((G32-D32)/D32*100,\"-\")","v":22.846936536040634},{"$f":"IFERROR((G32-E32)/E32*100,\"-\")","v":32.411340810183439},{"$f":"IFERROR((G32-F32)/F32*100,\"-\")","v":39.271314967239597}]

{"sheet":"4. PP","index":7,"n_rows":35,"n_cols":9,"rows_kept":35,"cut":false,"hidden":false,"merged":[[25,0,29,0],[19,0,23,0],[13,0,17,0]]}
[null,null,null,null,null,null,{"$f":"Codierung!I184","v":"Eidgenössisches Departement für  Wirtschaft, Bildung und Forschung WBF"}]
[null,null,null,null,null,null,{"$f":"Codierung!I185","v":"Bundesamt für Landwirtschaft BLW"}]
[null,null,null,null,null,null,{"$f":"Codierung!I186","v":"Fachbereich Marktanalysen"}]
[]
[]
[{"$f":"Codierung!I175","v":"Produzenten- und Importpreise"},null,null,null,null,null,{"$f":"Codierung!$I$242","v":"Anmerkungen:"}]
[{"$f":"Codierung!I217","v":"in CHF / Ei"},null,null,null,null,null,"(1)",{"$f":"Codierung!I248","v":"Erweiterung der Datenerhebungen bei den Sammelstellen"}]
[{"$f":"Codierung!$I$206","v":"Quellen: BLW, Fachbereich Marktanalysen; EZV"},null,null,null,null,null,null,{"$f":"Codierung!$I$238","v":"Daten Import"}]
[{"$f":"Codierung!I215","v":"Publikationsrecht: Weiterverarbeitung und Publikation unter Quellenangabe gestattet."},null,null,null,null,null,null,{"$f":"Codierung!$I$256","v":"Aufbereitete Grafiken unterhalb der Datentabellen"}]
[]
[{"$f":"Codierung!$I$154","v":"Zurück zum Inhaltsverzeichnis"}]
[{"$f":"Codierung!$I$253","v":"Informationen zur Methodik"},null,{"$f":"Codierung!$I$252&'D.4 PP'!$A$15&\"-\"&'D.4 PP'!$A$19","v":"Ø 2001-2005"},{"$f":"Codierung!$I$252&'D.4 PP'!$A$20&\"-\"&'D.4 PP'!$A$24","v":"Ø 2006-2010"},{"$f":"'D.4 PP'!$A$35","v":2021},{"$f":"'D.4 PP'!$A$36","v":2022},{"$f":"Codierung!$I$237&\" \"&C12","v":"%-∆ Ø 2001-2005"},{"$f":"Codierung!$I$237&\" \"&D12","v":"%-∆ Ø 2006-2010"},{"$f":"Codierung!$I$233","v":"%-∆ Vorjahr"}]
[]
[{"$f":"Codierung!$I$9","v":"Bio"},"< 50 g",{"$f":"IFERROR(AVERAGE('D.4 PP'!$B$15:$B$19),\"-\")","v":"-"},{"$f":"IFERROR(AVERAGE('D.4 PP'!$B$20:$B$24),\"-\")","v":"-"},{"$f":"IFERROR('D.4 PP'!$B$35,\"-\")","v":0.10675860864990142},{"$f":"IFERROR('D.4 PP'!$B$36,\"-\")","v":0.10756761020879257},{"$f":"IFERROR((F14-C14)/C14*100,\"-\")","v":"-"},{"$f":"IFERROR((F14-D14)/D14*100,\"-\")","v":"-"},{"$f":"IFERROR((F14-E14)/E14*100,\"-\")","v":0.7577857833874142}]
[null,"50 - 53 g",{"$f":"IFERROR(AVERAGE('D.4 PP'!$C$15:$C$19),\"-\")","v":"-"},{"$f":"IFERROR(AVERAGE('D.4 PP'!$C$20:$C$24),\"-\")","v":"-"},{"$f":"IFERROR('D.4 PP'!$C$35,\"-\")","v":0.19444717782532911},{"$f":"IFERROR('D.4 PP'!$C$36,\"-\")","v":0.19889567100085082},{"$f":"IFERROR((F15-C15)/C15*100,\"-\")","v":"-"},{"$f":"IFERROR((F15-D15)/D15*100,\"-\")","v":"-"},2.2877643302788195]
[null,"> 53 g",{"$f":"IFERROR(AVERAGE('D.4 PP'!$D$15:$D$19),\"-\")","v":"-"},{"$f":"IFERROR(AVERAGE('D.4 PP'!$D$20:$D$24),\"-\")","v":"-"},{"$f":"IFERROR('D.4 PP'!$D$35,\"-\")","v":0.46891313997002537},{"$f":"IFERROR('D.4 PP'!$D$36,\"-\")","v":0.47848929376908222},{"$f":"IFERROR((F16-C16)/C16*100,\"-\")","v":"-"},"-",{"$f":"IFERROR((F16-E16)/E16*100,\"-\")","v":2.042202058929079}]
[null,{"$f":"Codierung!$I$65","v":"2. Klasse"},{"$f":"IFERROR(AVERAGE('D.4 PP'!$E$15:$E$19),\"-\")","v":0.20075127383477009},{"$f":"IFERROR(AVERAGE('D.4 PP'!$E$20:$E$24),\"-\")","v":0.14446874878573737},{"$f":"IFERROR('D.4 PP'!$E$35,\"-\")","v":9.0332062700551247E-2},{"$f":"IFERROR('D.4 PP'!$E$36,\"-\")","v":0.10573558784820841},{"$f":"IFERROR((F17-C17)/C17*100,\"-\")","v":-47.330053838046922},-26.810754064863112,17.052112712979337]
[null,{"$f":"Codierung!$I$64","v":"Gewichteter Mittelwert"},{"$f":"IFERROR(AVERAGE('D.4 PP'!$F$15:$F$19),\"-\")","v":0.396259074742629},{"$f":"IFERROR(AVERAGE('D.4 PP'!$F$20:$F$24),\"-\")","v":0.39801568572036972},{"$f":"IFERROR('D.4 PP'!$F$35,\"-\")","v":0.43120707824739313},{"$f":"IFERROR('D.4 PP'!$F$36,\"-\")","v":0.44189808082591542},{"$f":"IFERROR((F18-C18)/C18*100,\"-\")","v":11.517466473904486},11.025292891691651,2.4793198251696196]
[]
[{"$f":"Codierung!$I$10","v":"Bodenhaltung"},"< 50 g",{"$f":"IFERROR(AVERAGE('D.4 PP'!$G$15:$G$19),\"-\")","v":"-"},{"$f":"IFERROR(AVERAGE('D.4 PP'!$G$20:$G$24),\"-\")","v":"-"},{"$f":"IFERROR('D.4 PP'!$G$35,\"-\")","v":5.0263017106113618E-2},{"$f":"IFERROR('D.4 PP'!$G$36,\"-\")","v":5.2924022679087336E-2},{"$f":"IFERROR((F20-C20)/C20*100,\"-\")","v":"-"},"-",5.2941620423539071]
[null,"50 - 53 g",{"$f":"IFERROR(AVERAGE('D.4 PP'!$H$15:$H$19),\"-\")","v":"-"},{"$f":"IFERROR(AVERAGE('D.4 PP'!$H$20:$H$24),\"-\")","v":"-"},{"$f":"IFERROR('D.4 PP'!$H$35,\"-\")","v":0.15091183718344936},{"$f":"IFERROR('D.4 PP'!$H$36,\"-\")","v":0.15237198872079927},{"$f":"IFERROR((F21-C21)/C21*100,\"-\")","v":"-"},"-",0.96755268811348316]
[null,"> 53 g",{"$f":"IFERROR(AVERAGE('D.4 PP'!$I$15:$I$19),\"-\")","v":"-"},{"$f":"IFERROR(AVERAGE('D.4 PP'!$I$20:$I$24),\"-\")","v":"-"},{"$f":"IFERROR('D.4 PP'!$I$35,\"-\")","v":0.23082338995512625},{"$f":"IFERROR('D.4 PP'!$I$36,\"-\")","v":0.23482600173222082},{"$f":"IFERROR((F22-C22)/C22*100,\"-\")","v":"-"},"-",1.7340581376405177]
[null,{"$f":"Codierung!$I$65","v":"2. Klasse"},{"$f":"IFERROR(AVERAGE('D.4 PP'!$J$15:$J$19),\"-\")","v":8.368504850260497E-2},{"$f":"IFERROR(AVERAGE('D.4 PP'!$J$20:$J$24),\"-\")","v":0.12064317200787397},{"$f":"IFERROR('D.4 PP'!$J$35,\"-\")","v":3.7411918145604579E-2},{"$f":"IFERROR('D.4 PP'!$J$36,\"-\")","v":3.789781167067105E-2},{"$f":"IFERROR((F23-C23)/C23*100,\"-\")","v":-54.713760284800031},-68.586857391152151,1.2987666742330797]
[null,{"$f":"Codierung!$I$64","v":"Gewichteter Mittelwert"},{"$f":"IFERROR(AVERAGE('D.4 PP'!$K$15:$K$19),\"-\")","v":0.22683741222687095},{"$f":"IFERROR(AVERAGE('D.4 PP'!$K$20:$K$24),\"-\")","v":0.22304772561418357},{"$f":"IFERROR('D.4 PP'!$K$35,\"-\")","v":0.20593634293521643},{"$f":"IFERROR('D.4 PP'!$K$36,\"-\")","v":0.21129116467928008},{"$f":"IFERROR((F24-C24)/C24*100,\"-\")","v":-6.85347597425522},-5.2708723671271054,2.6002315413303112]
[]
[{"$f":"Codierung!$I$11","v":"Freilandhaltung"},"< 50 g",{"$f":"IFERROR(AVERAGE('D.4 PP'!$L$15:$L$19),\"-\")","v":"-"},{"$f":"IFERROR(AVERAGE('D.4 PP'!$L$20:$L$24),\"-\")","v":"-"},{"$f":"IFERROR('D.4 PP'!$L$35,\"-\")","v":4.9998696371793154E-2},{"$f":"IFERROR('D.4 PP'!$L$36,\"-\")","v":4.9693662091601483E-2},{"$f":"IFERROR((F26-C26)/C26*100,\"-\")","v":"-"},"-",-0.61008446684973305]
[null,"50 - 53 g",{"$f":"IFERROR(AVERAGE('D.4 PP'!$M$15:$M$19),\"-\")","v":"-"},{"$f":"IFERROR(AVERAGE('D.4 PP'!$M$20:$M$24),\"-\")","v":"-"},{"$f":"IFERROR('D.4 PP'!$M$35,\"-\")","v":0.14785317576515092},{"$f":"IFERROR('D.4 PP'!$M$36,\"-\")","v":0.14825459957207138},{"$f":"IFERROR((F27-C27)/C27*100,\"-\")","v":"-"},"-",0.2715016467134112]
[null,"> 53 g",{"$f":"IFERROR(AVERAGE('D.4 PP'!$N$15:$N$19),\"-\")","v":"-"},{"$f":"IFERROR(AVERAGE('D.4 PP'!$N$20:$N$24),\"-\")","v":"-"},{"$f":"IFERROR('D.4 PP'!$N$35,\"-\")","v":0.24089181355132211},{"$f":"IFERROR('D.4 PP'!$N$36,\"-\")","v":0.250344336319136},{"$f":"IFERROR((F28-C28)/C28*100,\"-\")","v":"-"},"-",3.9239701127493989]
[null,{"$f":"Codierung!$I$65","v":"2. Klasse"},{"$f":"IFERROR(AVERAGE('D.4 PP'!$O$15:$O$19),\"-\")","v":6.6343529477396829E-2},{"$f":"IFERROR(AVERAGE('D.4 PP'!$O$20:$O$24),\"-\")","v":8.864949061237519E-2},{"$f":"IFERROR('D.4 PP'!$O$35,\"-\")","v":5.0124534159388397E-2},{"$f":"IFERROR('D.4 PP'!$O$36,\"-\")","v":5.2296150166588104E-2},{"$f":"IFERROR((F29-C29)/C29*100,\"-\")","v":-21.173699110468117},-41.0079518727796,4.3324412757519077]
[null,{"$f":"Codierung!$I$64","v":"Gewichteter Mittelwert"},{"$f":"IFERROR(AVERAGE('D.4 PP'!$P$15:$P$19),\"-\")","v":0.25089497019587587},{"$f":"IFERROR(AVERAGE('D.4 PP'!$P$20:$P$24),\"-\")","v":0.23242737340415304},{"$f":"IFERROR('D.4 PP'!$P$35,\"-\")","v":0.22067574612839355},{"$f":"IFERROR('D.4 PP'!$P$36,\"-\")","v":0.22942256586891285},{"$f":"IFERROR((F30-C30)/C30*100,\"-\")","v":-8.5583239513328309},-1.2927941710270574,3.9636525055319076]
[]
[{"$f":"Codierung!$I$66","v":"CH gesamt"},{"$f":"Codierung!$I$64","v":"Gewichteter Mittelwert"},{"$f":"IFERROR(AVERAGE('D.4 PP'!$Q$15:$Q$19),\"-\")","v":0.25759425446627071},{"$f":"IFERROR(AVERAGE('D.4 PP'!$Q$20:$Q$24),\"-\")","v":0.25681386881317436},{"$f":"IFERROR('D.4 PP'!$Q$35,\"-\")","v":0.26754793682574785},{"$f":"IFERROR('D.4 PP'!$Q$36,\"-\")","v":0.28084302187685167},{"$f":"IFERROR((F32-C32)/C32*100,\"-\")","v":9.0253439304195151},9.3566415142314288,4.9692347505422276]
[{"$f":"Codierung!$I$67","v":"Verarbeitungseier Import"},{"$f":"Codierung!$I$64","v":"Gewichteter Mittelwert"},{"$f":"IFERROR(AVERAGE('D.4 PP'!$R$15:$R$19),\"-\")","v":0.11151643669002091},{"$f":"IFERROR(AVERAGE('D.4 PP'!$R$20:$R$24),\"-\")","v":0.12006749745095099},{"$f":"IFERROR('D.4 PP'!$R$35,\"-\")","v":0.11862647527006649},{"$f":"IFERROR('D.4 PP'!$R$36,\"-\")","v":0.14582397760162977},{"$f":"IFERROR((F33-C33)/C33*100,\"-\")","v":30.764559853156499},21.451667351691579,22.927008721826308]
[{"$f":"Codierung!$I$68","v":"Konsumeier Import"},{"$f":"Codierung!$I$64","v":"Gewichteter Mittelwert"},{"$f":"IFERROR(AVERAGE('D.4 PP'!$S$15:$S$19),\"-\")","v":0.14724739909197709},{"$f":"IFERROR(AVERAGE('D.4 PP'!$S$20:$S$24),\"-\")","v":0.16094774052853478},{"$f":"IFERROR('D.4 PP'!$S$35,\"-\")","v":0.1385772466167649},{"$f":"IFERROR('D.4 PP'!$S$36,\"-\")","v":0.15184924283921197},{"$f":"IFERROR((F34-C34)/C34*100,\"-\")","v":3.1252462017073519},-5.653075749584513,9.577327120050775]
[{"$f":"Codierung!$I$69","v":"CH und Import"},{"$f":"Codierung!$I$64","v":"Gewichteter Mittelwert"},{"$f":"IFERROR(AVERAGE('D.4 PP'!$T$15:$T$19),\"-\")","v":0.20596165638850641},{"$f":"IFERROR(AVERAGE('D.4 PP'!$T$20:$T$24),\"-\")","v":0.2062034027077603},{"$f":"IFERROR('D.4 PP'!$T$35,\"-\")","v":0.22639660446759069},{"$f":"IFERROR('D.4 PP'!$T$36,\"-\")","v":0.2429991563342826},{"$f":"IFERROR((F35-C35)/C35*100,\"-\")","v":17.982716101249533},17.844396912630341,7.333392612374011]

{"sheet":"5. GHP","index":8,"n_rows":24,"n_cols":9,"rows_kept":24,"cut":false,"hidden":false,"merged":[[13,0,17,0],[19,0,23,0]]}
[null,null,null,null,null,null,{"$f":"Codierung!I184","v":"Eidgenössisches Departement für  Wirtschaft, Bildung und Forschung WBF"}]
[null,null,null,null,null,null,{"$f":"Codierung!I185","v":"Bundesamt für Landwirtschaft BLW"}]
[null,null,null,null,null,null,{"$f":"Codierung!I186","v":"Fachbereich Marktanalysen"}]
[]
[]
[{"$f":"Codierung!I176","v":"Preise im Liefer- und Abholgrosshandel"},null,null,null,null,null,{"$f":"Codierung!$I$242","v":"Anmerkungen:"}]
[{"$f":"Codierung!I217","v":"in CHF / Ei"},null,null,null,null,null,{"$f":"Codierung!$I$238","v":"Daten Import"}]
[{"$f":"Codierung!$I$207","v":"Quellen: BLW, Fachbereich Marktanalysen; Grossopanel AG, Stans"},null,null,null,null,null,{"$f":"Codierung!$I$256","v":"Aufbereitete Grafiken unterhalb der Datentabellen"}]
[{"$f":"Codierung!I215","v":"Publikationsrecht: Weiterverarbeitung und Publikation unter Quellenangabe gestattet."},null,null,null,null,"(1)",{"$f":"Codierung!$I$263","v":"Erweiterung des Datenpanels von Grossopanel"}]
[]
[{"$f":"Codierung!$I$154","v":"Zurück zum Inhaltsverzeichnis"}]
[{"$f":"Codierung!$I$253","v":"Informationen zur Methodik"},null,{"$f":"'D.5 GHP Gastro'!$A$21","v":2019},{"$f":"'D.5 GHP Gastro'!$A$22","v":2020},{"$f":"'D.5 GHP Gastro'!$A$23","v":2021},{"$f":"'D.5 GHP Gastro'!$A$24","v":2022},{"$f":"Codierung!$I$237&\" \"&C12","v":"%-∆ 2019"},{"$f":"Codierung!$I$237&\" \"&D12","v":"%-∆ 2020"},{"$f":"Codierung!$I$233","v":"%-∆ Vorjahr"}]
[]
[{"$f":"Codierung!$I$78","v":"Eier frisch"},{"$f":"Codierung!$I$9","v":"Bio"},{"$f":"IFERROR('D.5 GHP Gastro'!$B$21,\"-\")","v":0.7253631687375337},{"$f":"IFERROR('D.5 GHP Gastro'!$B$22,\"-\")","v":0.7138324021886987},{"$f":"IFERROR('D.5 GHP Gastro'!$B$23,\"-\")","v":0.70619076618391441},{"$f":"IFERROR('D.5 GHP Gastro'!$B$24,\"-\")","v":0.72688734731028604},{"$f":"IFERROR((F14-C14)/C14*100,\"-\")","v":0.21012627032126627},{"$f":"IFERROR((F14-D14)/D14*100,\"-\")","v":1.8288529746701403},{"$f":"IFERROR((F14-E14)/E14*100,\"-\")","v":2.9307351663929264}]
[null,{"$f":"Codierung!$I$10","v":"Bodenhaltung"},{"$f":"IFERROR('D.5 GHP Gastro'!$C$21,\"-\")","v":0.39469204554476106},{"$f":"IFERROR('D.5 GHP Gastro'!$C$22,\"-\")","v":0.38470647879240455},{"$f":"IFERROR('D.5 GHP Gastro'!$C$23,\"-\")","v":0.3668494318782432},{"$f":"IFERROR('D.5 GHP Gastro'!$C$24,\"-\")","v":0.38807671637106195},{"$f":"IFERROR((F15-C15)/C15*100,\"-\")","v":-1.6760735992458415},{"$f":"IFERROR((F15-D15)/D15*100,\"-\")","v":0.87605428149704934},{"$f":"IFERROR((F15-E15)/E15*100,\"-\")","v":5.7863751850824858}]
[null,{"$f":"Codierung!$I$11","v":"Freilandhaltung"},{"$f":"IFERROR('D.5 GHP Gastro'!$D$21,\"-\")","v":0.56359111303011311},{"$f":"IFERROR('D.5 GHP Gastro'!$D$22,\"-\")","v":0.49403063685183585},{"$f":"IFERROR('D.5 GHP Gastro'!$D$23,\"-\")","v":0.48803750940149526},{"$f":"IFERROR('D.5 GHP Gastro'!$D$24,\"-\")","v":0.49287155224928286},-12.548026245589798,-0.23461796012068056,0.99050641695877606]
[null,{"$f":"Codierung!$I$81","v":"alle Produktionsformen CH"},{"$f":"IFERROR('D.5 GHP Gastro'!$E$21,\"-\")","v":0.50923399694417237},{"$f":"IFERROR('D.5 GHP Gastro'!$E$22,\"-\")","v":0.48351095962927698},{"$f":"IFERROR('D.5 GHP Gastro'!$E$23,\"-\")","v":0.47442242975945814},{"$f":"IFERROR('D.5 GHP Gastro'!$E$24,\"-\")","v":0.47734659579939548},-6.2618366676474526,-1.2749170845285314,0.61636336237726974]
[null,{"$f":"Codierung!$I$80","v":"Bodenhaltung Import"},{"$f":"IFERROR('D.5 GHP Gastro'!$F$21,\"-\")","v":0.33940742715994865},{"$f":"IFERROR('D.5 GHP Gastro'!$F$22,\"-\")","v":0.33626930733306643},{"$f":"IFERROR('D.5 GHP Gastro'!$F$23,\"-\")","v":0.32617657645443277},{"$f":"IFERROR('D.5 GHP Gastro'!$F$24,\"-\")","v":0.35162714277618856},3.6003088437075559,4.5671237630708239,7.8026958889585591]
[]
[{"$f":"Codierung!$I$79","v":"Eier gekocht"},{"$f":"Codierung!$I$9","v":"Bio"},{"$f":"IFERROR('D.5 GHP Gastro'!$G$21,\"-\")","v":"-"},{"$f":"IFERROR('D.5 GHP Gastro'!$G$22,\"-\")","v":"-"},{"$f":"IFERROR('D.5 GHP Gastro'!$G$23,\"-\")","v":"-"},{"$f":"IFERROR('D.5 GHP Gastro'!$G$24,\"-\")","v":"-"},"-","-","-"]
[null,{"$f":"Codierung!$I$10","v":"Bodenhaltung"},{"$f":"IFERROR('D.5 GHP Gastro'!$H$21,\"-\")","v":0.4723466215757699},{"$f":"IFERROR('D.5 GHP Gastro'!$H$22,\"-\")","v":0.48189810317215681},{"$f":"IFERROR('D.5 GHP Gastro'!$H$23,\"-\")","v":0.48808033082370555},{"$f":"IFERROR('D.5 GHP Gastro'!$H$24,\"-\")","v":0.50200972534161237},6.2799440942088252,4.1734179979269879,2.8539143329949317]
[null,{"$f":"Codierung!$I$11","v":"Freilandhaltung"},{"$f":"IFERROR('D.5 GHP Gastro'!$I$21,\"-\")","v":0.62007913104040135},{"$f":"IFERROR('D.5 GHP Gastro'!$I$22,\"-\")","v":0.67645855462316007},{"$f":"IFERROR('D.5 GHP Gastro'!$I$23,\"-\")","v":0.6844503722766101},{"$f":"IFERROR('D.5 GHP Gastro'!$I$24,\"-\")","v":0.67904590908440454},9.5095569407513576,0.38248528953644922,-0.78960629011410999]
[null,{"$f":"Codierung!$I$81","v":"alle Produktionsformen CH"},{"$f":"IFERROR('D.5 GHP Gastro'!$J$21,\"-\")","v":0.57095060079059257},{"$f":"IFERROR('D.5 GHP Gastro'!$J$22,\"-\")","v":0.6296217841392463},{"$f":"IFERROR('D.5 GHP Gastro'!$J$23,\"-\")","v":0.63509751539155834},{"$f":"IFERROR('D.5 GHP Gastro'!$J$24,\"-\")","v":0.63264996438590881},10.806427650637627,0.48095226736831059,-0.38538192109609082]
[null,{"$f":"Codierung!$I$80","v":"Bodenhaltung Import"},{"$f":"IFERROR('D.5 GHP Gastro'!$K$21,\"-\")","v":0.48596859046750762},{"$f":"IFERROR('D.5 GHP Gastro'!$K$22,\"-\")","v":0.52214789852927423},{"$f":"IFERROR('D.5 GHP Gastro'!$K$23,\"-\")","v":0.52648521827064232},{"$f":"IFERROR('D.5 GHP Gastro'!$K$24,\"-\")","v":0.52873419283941803},8.8000753980353714,1.2613848161977292,0.42716765651331384]

{"sheet":"6. KP","index":9,"n_rows":39,"n_cols":9,"rows_kept":39,"cut":false,"hidden":false,"merged":[[35,0,38,0],[30,0,33,0],[25,0,28,0],[19,0,23,0],[13,0,17,0]]}
[null,null,null,null,null,null,{"$f":"Codierung!I184","v":"Eidgenössisches Departement für  Wirtschaft, Bildung und Forschung WBF"}]
[null,null,null,null,null,null,{"$f":"Codierung!I185","v":"Bundesamt für Landwirtschaft BLW"}]
[null,null,null,null,null,null,{"$f":"Codierung!I186","v":"Fachbereich Marktanalysen"}]
[]
[]
[{"$f":"Codierung!I82","v":"Konsumentenpreise"},null,null,null,null,{"$f":"Codierung!$I$242","v":"Anmerkungen:"}]
[{"$f":"Codierung!I217","v":"in CHF / Ei"},null,null,null,null,"(1)",{"$f":"Codierung!$I$257","v":"Ab 2016 wurde die Konsumentenpreiserhebung erweitert. Der Discountmarkt ist nun mit drei Akteuren in der Erhebung vertreten. Dadurch sind die Preise leicht gesunken."}]
[{"$f":"Codierung!$I$205","v":"Quellen: BLW, Fachbereich Marktanalysen"},null,null,null,null,"(2)",{"$f":"Codierung!$I$262","v":"Ab 2019 wurde die Konsumentenpreiserhebung erweitert. Der Verbrauchermarkt ist nun mit zwei Akteuren in der Erhebung vertreten. Die Preise blieben konstant."}]
[{"$f":"Codierung!I215","v":"Publikationsrecht: Weiterverarbeitung und Publikation unter Quellenangabe gestattet."},null,null,null,null,null,{"$f":"Codierung!$I$238","v":"Daten Import"}]
[null,null,null,null,null,null,{"$f":"Codierung!$I$256","v":"Aufbereitete Grafiken unterhalb der Datentabellen"}]
[{"$f":"Codierung!$I$154","v":"Zurück zum Inhaltsverzeichnis"}]
[{"$f":"Codierung!$I$253","v":"Informationen zur Methodik"},null,{"$f":"Codierung!$I$252&'D.6 KP'!$A$15&\"-\"&'D.6 KP'!$A$19","v":"Ø 2001-2005"},{"$f":"Codierung!$I$252&'D.6 KP'!$A$20&\"-\"&'D.6 KP'!$A$24","v":"Ø 2006-2010"},{"$f":"'D.6 KP'!$A$35","v":2021},{"$f":"'D.6 KP'!$A$36","v":2022},{"$f":"Codierung!$J$237&\" \"&C12","v":"%-∆ Ø 2001-2005"},{"$f":"Codierung!$J$237&\" \"&D12","v":"%-∆ Ø 2006-2010"},{"$f":"Codierung!$I$233","v":"%-∆ Vorjahr"}]
[]
[{"$f":"Codierung!$I$78","v":"Eier frisch"},{"$f":"Codierung!$I$9","v":"Bio"},{"$f":"IFERROR(AVERAGE('D.6 KP'!$B$15:$B$19),\"-\")","v":0.80427472288153601},{"$f":"IFERROR(AVERAGE('D.6 KP'!$B$20:$B$24),\"-\")","v":0.81900994967022511},{"$f":"IFERROR('D.6 KP'!$B$35,\"-\")","v":0.82412455607059854},{"$f":"IFERROR('D.6 KP'!$B$36,\"-\")","v":0.83080605128283047},{"$f":"IFERROR((F14-C14)/C14*100,\"-\")","v":3.2987892876004685},{"$f":"IFERROR((F14-D14)/D14*100,\"-\")","v":1.4402879497807159},{"$f":"IFERROR((F14-E14)/E14*100,\"-\")","v":0.81073851798435759}]
[null,{"$f":"Codierung!$I$10","v":"Bodenhaltung"},{"$f":"IFERROR(AVERAGE('D.6 KP'!$C$15:$C$19),\"-\")","v":0.47561614196402296},{"$f":"IFERROR(AVERAGE('D.6 KP'!$C$20:$C$24),\"-\")","v":0.47950590406000726},{"$f":"IFERROR('D.6 KP'!$C$35,\"-\")","v":0.42078150366278783},{"$f":"IFERROR('D.6 KP'!$C$36,\"-\")","v":0.39322394617955592},{"$f":"IFERROR((F15-C15)/C15*100,\"-\")","v":-17.323254724752264},{"$f":"IFERROR((F15-D15)/D15*100,\"-\")","v":-17.993930241504113},-6.5491370802544582]
[null,{"$f":"Codierung!$I$11","v":"Freilandhaltung"},{"$f":"IFERROR(AVERAGE('D.6 KP'!$D$15:$D$19),\"-\")","v":0.61702023891169344},{"$f":"IFERROR(AVERAGE('D.6 KP'!$D$20:$D$24),\"-\")","v":0.62266143426206111},{"$f":"IFERROR('D.6 KP'!$D$35,\"-\")","v":0.58378090061973675},{"$f":"IFERROR('D.6 KP'!$D$36,\"-\")","v":0.58112895314586355},{"$f":"IFERROR((F16-C16)/C16*100,\"-\")","v":-5.8168733377587918},{"$f":"IFERROR((F16-D16)/D16*100,\"-\")","v":-6.6701547311050717},{"$f":"IFERROR((F16-E16)/E16*100,\"-\")","v":-0.45427102377928463}]
[null,{"$f":"Codierung!$I$81","v":"alle Produktionsformen CH"},{"$f":"IFERROR(AVERAGE('D.6 KP'!$E$15:$E$19),\"-\")","v":0.5665216814322237},{"$f":"IFERROR(AVERAGE('D.6 KP'!$E$20:$E$24),\"-\")","v":0.58800429442506696},{"$f":"IFERROR('D.6 KP'!$E$35,\"-\")","v":0.61051939627057727},{"$f":"IFERROR('D.6 KP'!$E$36,\"-\")","v":0.61819541377032405},{"$f":"IFERROR((F17-C17)/C17*100,\"-\")","v":9.1212276655438789},{"$f":"IFERROR((F17-D17)/D17*100,\"-\")","v":5.1345066067548135},1.2572929781816187]
[null,{"$f":"Codierung!$I$80","v":"Bodenhaltung Import"},{"$f":"IFERROR(AVERAGE('D.6 KP'!$F$15:$F$19),\"-\")","v":0.31064225362232539},{"$f":"IFERROR(AVERAGE('D.6 KP'!$F$20:$F$24),\"-\")","v":0.3247954220290693},{"$f":"IFERROR('D.6 KP'!$F$35,\"-\")","v":0.21823160362189958},{"$f":"IFERROR('D.6 KP'!$F$36,\"-\")","v":0.22671404758347313},{"$f":"IFERROR((F18-C18)/C18*100,\"-\")","v":-27.017640086042842},{"$f":"IFERROR((F18-D18)/D18*100,\"-\")","v":-30.197893133117454},3.8868998902056062]
[]
[{"$f":"Codierung!$I$79","v":"Eier gekocht"},{"$f":"Codierung!$I$9","v":"Bio"},{"$f":"IFERROR(AVERAGE('D.6 KP'!$G$15:$G$19),\"-\")","v":0.92599440965047497},{"$f":"IFERROR(AVERAGE('D.6 KP'!$G$20:$G$24),\"-\")","v":0.95090850592802689},{"$f":"IFERROR('D.6 KP'!$G$35,\"-\")","v":0.95092649216856995},{"$f":"IFERROR('D.6 KP'!$G$36,\"-\")","v":0.92298616533062283},{"$f":"IFERROR((F20-C20)/C20*100,\"-\")","v":-0.32486635864115282},{"$f":"IFERROR((F20-D20)/D20*100,\"-\")","v":-2.936385616842665},-2.9382215205961635]
[null,{"$f":"Codierung!$I$10","v":"Bodenhaltung"},{"$f":"IFERROR(AVERAGE('D.6 KP'!$H$15:$H$19),\"-\")","v":0.57425239787083915},{"$f":"IFERROR(AVERAGE('D.6 KP'!$H$20:$H$24),\"-\")","v":0.62874525704874062},{"$f":"IFERROR('D.6 KP'!$H$35,\"-\")","v":0.60336063359871217},{"$f":"IFERROR('D.6 KP'!$H$36,\"-\")","v":0.59372357267885534},{"$f":"IFERROR((F21-C21)/C21*100,\"-\")","v":3.3906997829194347},{"$f":"IFERROR((F21-D21)/D21*100,\"-\")","v":-5.5700912217251748},-1.5972306417104307]
[null,{"$f":"Codierung!$I$11","v":"Freilandhaltung"},{"$f":"IFERROR(AVERAGE('D.6 KP'!$I$15:$I$19),\"-\")","v":0.75321132481459219},{"$f":"IFERROR(AVERAGE('D.6 KP'!$I$20:$I$24),\"-\")","v":0.80331616738670775},{"$f":"IFERROR('D.6 KP'!$I$35,\"-\")","v":0.69359877460749231},{"$f":"IFERROR('D.6 KP'!$I$36,\"-\")","v":0.67286087076475243},{"$f":"IFERROR((F22-C22)/C22*100,\"-\")","v":-10.667717200032612},{"$f":"IFERROR((F22-D22)/D22*100,\"-\")","v":-16.239595556298013},-2.9898991465888134]
[null,{"$f":"Codierung!$I$81","v":"alle Produktionsformen CH"},{"$f":"IFERROR(AVERAGE('D.6 KP'!$J$15:$J$19),\"-\")","v":0.68041945365423995},{"$f":"IFERROR(AVERAGE('D.6 KP'!$J$20:$J$24),\"-\")","v":0.72907338936562849},{"$f":"IFERROR('D.6 KP'!$J$35,\"-\")","v":0.71649564325759219},{"$f":"IFERROR('D.6 KP'!$J$36,\"-\")","v":0.69553904553972234},{"$f":"IFERROR((F23-C23)/C23*100,\"-\")","v":2.2220987075371785},{"$f":"IFERROR((F23-D23)/D23*100,\"-\")","v":-4.5995841180110268},-2.9248744099251405]
[null,{"$f":"Codierung!$I$80","v":"Bodenhaltung Import"},{"$f":"IFERROR(AVERAGE('D.6 KP'!$K$15:$K$19),\"-\")","v":0.39274270233985686},{"$f":"IFERROR(AVERAGE('D.6 KP'!$K$20:$K$24),\"-\")","v":0.34721128494291714},{"$f":"IFERROR('D.6 KP'!$K$35,\"-\")","v":0.30783442617684581},{"$f":"IFERROR('D.6 KP'!$K$36,\"-\")","v":0.31215988915465803},{"$f":"IFERROR((F24-C24)/C24*100,\"-\")","v":-20.517965758525314},{"$f":"IFERROR((F24-D24)/D24*100,\"-\")","v":-10.095119976881424},1.4051264608485716]
[]
[{"$f":"Codierung!$I$83","v":"4er Packung frisch"},{"$f":"Codierung!$I$9","v":"Bio"},{"$f":"IFERROR(AVERAGE('D.6 KP'!$L$15:$L$19),\"-\")","v":0.80957517572999771},{"$f":"IFERROR(AVERAGE('D.6 KP'!$L$20:$L$24),\"-\")","v":0.8302968203436677},{"$f":"IFERROR('D.6 KP'!$L$35,\"-\")","v":0.84774692315862421},{"$f":"IFERROR('D.6 KP'!$L$36,\"-\")","v":0.86798694849909974},{"$f":"IFERROR((F26-C26)/C26*100,\"-\")","v":7.2151141141935176},{"$f":"IFERROR((F26-D26)/D26*100,\"-\")","v":4.5393559546370108},2.3875079681873839]
[null,{"$f":"Codierung!$I$10","v":"Bodenhaltung"},{"$f":"IFERROR(AVERAGE('D.6 KP'!$M$15:$M$19),\"-\")","v":0.63263045088774006},{"$f":"IFERROR(AVERAGE('D.6 KP'!$M$20:$M$24),\"-\")","v":0.62791175937339949},{"$f":"IFERROR('D.6 KP'!$M$35,\"-\")","v":0.49556178397700107},{"$f":"IFERROR('D.6 KP'!$M$36,\"-\")","v":0.53918899395164144},{"$f":"IFERROR((F27-C27)/C27*100,\"-\")","v":-14.770306551791284},{"$f":"IFERROR((F27-D27)/D27*100,\"-\")","v":-14.12981427681742},8.8035864316496806]
[null,{"$f":"Codierung!$I$11","v":"Freilandhaltung"},{"$f":"IFERROR(AVERAGE('D.6 KP'!$N$15:$N$19),\"-\")","v":0.67081225975634418},{"$f":"IFERROR(AVERAGE('D.6 KP'!$N$20:$N$24),\"-\")","v":0.69843787478814756},{"$f":"IFERROR('D.6 KP'!$N$35,\"-\")","v":0.69306554768559026},{"$f":"IFERROR('D.6 KP'!$N$36,\"-\")","v":0.70969804983031681},{"$f":"IFERROR((F28-C28)/C28*100,\"-\")","v":5.7968216156480104},{"$f":"IFERROR((F28-D28)/D28*100,\"-\")","v":1.6121942192188137},2.3998454692011189]
[null,{"$f":"Codierung!$I$81","v":"alle Produktionsformen CH"},{"$f":"IFERROR(AVERAGE('D.6 KP'!$O$15:$O$19),\"-\")","v":0.73021144955102701},{"$f":"IFERROR(AVERAGE('D.6 KP'!$O$20:$O$24),\"-\")","v":0.74641472659760111},{"$f":"IFERROR('D.6 KP'!$O$35,\"-\")","v":0.75355818713067135},{"$f":"IFERROR('D.6 KP'!$O$36,\"-\")","v":0.78840541307409462},{"$f":"IFERROR((F29-C29)/C29*100,\"-\")","v":7.9694674136989168},{"$f":"IFERROR((F29-D29)/D29*100,\"-\")","v":5.6256508587257645},4.6243576857828703]
[]
[{"$f":"Codierung!$I$84","v":"6er Packung frisch"},{"$f":"Codierung!$I$9","v":"Bio"},{"$f":"IFERROR(AVERAGE('D.6 KP'!$P$15:$P$19),\"-\")","v":0.79564607319080516},{"$f":"IFERROR(AVERAGE('D.6 KP'!$P$20:$P$24),\"-\")","v":0.81152312800969018},{"$f":"IFERROR('D.6 KP'!$P$35,\"-\")","v":0.83602415393860707},{"$f":"IFERROR('D.6 KP'!$P$36,\"-\")","v":0.84922813388603458},{"$f":"IFERROR((F31-C31)/C31*100,\"-\")","v":6.7344089917200938},{"$f":"IFERROR((F31-D31)/D31*100,\"-\")","v":4.6462022553587872},1.5793778068757962]
[null,{"$f":"Codierung!$I$10","v":"Bodenhaltung"},{"$f":"IFERROR(AVERAGE('D.6 KP'!$Q$15:$Q$19),\"-\")","v":0.51211738608377755},{"$f":"IFERROR(AVERAGE('D.6 KP'!$Q$20:$Q$24),\"-\")","v":0.51301716626592686},{"$f":"IFERROR('D.6 KP'!$Q$35,\"-\")","v":0.54413561604708671},{"$f":"IFERROR('D.6 KP'!$Q$36,\"-\")","v":0.55489653853562537},{"$f":"IFERROR((F32-C32)/C32*100,\"-\")","v":8.3533880345256541},{"$f":"IFERROR((F32-D32)/D32*100,\"-\")","v":8.1633471594184392},1.9776177429281647]
[null,{"$f":"Codierung!$I$11","v":"Freilandhaltung"},{"$f":"IFERROR(AVERAGE('D.6 KP'!$R$15:$R$19),\"-\")","v":0.60837423287405168},{"$f":"IFERROR(AVERAGE('D.6 KP'!$R$20:$R$24),\"-\")","v":0.62215402295075783},{"$f":"IFERROR('D.6 KP'!$R$35,\"-\")","v":0.6042637980308867},{"$f":"IFERROR('D.6 KP'!$R$36,\"-\")","v":0.61691587034182915},{"$f":"IFERROR((F33-C33)/C33*100,\"-\")","v":1.4040103946259344},{"$f":"IFERROR((F33-D33)/D33*100,\"-\")","v":-0.84193823646516386},2.0937994882651809]
[null,{"$f":"Codierung!$I$81","v":"alle Produktionsformen CH"},{"$f":"IFERROR(AVERAGE('D.6 KP'!$S$15:$S$19),\"-\")","v":0.57410333412570747},{"$f":"IFERROR(AVERAGE('D.6 KP'!$S$20:$S$24),\"-\")","v":0.60708356191559676},{"$f":"IFERROR('D.6 KP'!$S$35,\"-\")","v":0.67663412252179977},{"$f":"IFERROR('D.6 KP'!$S$36,\"-\")","v":0.69749597958848786},{"$f":"IFERROR((F34-C34)/C34*100,\"-\")","v":21.493107273221646},{"$f":"IFERROR((F34-D34)/D34*100,\"-\")","v":14.892911510831059},3.083181349018643]
[]
[{"$f":"Codierung!$I$85","v":"10er Packung frisch"},{"$f":"Codierung!$I$9","v":"Bio"},{"$f":"IFERROR(AVERAGE('D.6 KP'!$T$15:$T$19),\"-\")","v":"-"},{"$f":"IFERROR(AVERAGE('D.6 KP'!$T$20:$T$24),\"-\")","v":"-"},{"$f":"IFERROR('D.6 KP'!$T$35,\"-\")","v":0.77925418145358427},{"$f":"IFERROR('D.6 KP'!$T$36,\"-\")","v":0.77416852733483754},{"$f":"IFERROR((F36-C36)/C36*100,\"-\")","v":"-"},{"$f":"IFERROR((F36-D36)/D36*100,\"-\")","v":"-"},-0.65263096943030696]
[null,{"$f":"Codierung!$I$10","v":"Bodenhaltung"},{"$f":"IFERROR(AVERAGE('D.6 KP'!$U$15:$U$19),\"-\")","v":0.44206851741053893},{"$f":"IFERROR(AVERAGE('D.6 KP'!$U$20:$U$24),\"-\")","v":0.4431267371885248},{"$f":"IFERROR('D.6 KP'!$U$35,\"-\")","v":0.35736355857643853},{"$f":"IFERROR('D.6 KP'!$U$36,\"-\")","v":0.36473201923549003},{"$f":"IFERROR((F37-C37)/C37*100,\"-\")","v":-17.494233388990299},{"$f":"IFERROR((F37-D37)/D37*100,\"-\")","v":-17.691263328053786},2.0618948077425245]
[null,{"$f":"Codierung!$I$11","v":"Freilandhaltung"},{"$f":"IFERROR(AVERAGE('D.6 KP'!$V$15:$V$19),\"-\")","v":0.5645444591941372},{"$f":"IFERROR(AVERAGE('D.6 KP'!$V$20:$V$24),\"-\")","v":0.5656355164754201},{"$f":"IFERROR('D.6 KP'!$V$35,\"-\")","v":0.54408764032390033},{"$f":"IFERROR('D.6 KP'!$V$36,\"-\")","v":0.55403333366100782},{"$f":"IFERROR((F38-C38)/C38*100,\"-\")","v":-1.8618773706739695},{"$f":"IFERROR((F38-D38)/D38*100,\"-\")","v":-2.0511765043870711},1.8279579611819017]
[null,{"$f":"Codierung!$I$81","v":"alle Produktionsformen CH"},{"$f":"IFERROR(AVERAGE('D.6 KP'!$W$15:$W$19),\"-\")","v":0.46566559522500245},{"$f":"IFERROR(AVERAGE('D.6 KP'!$W$20:$W$24),\"-\")","v":0.47963384706790002},{"$f":"IFERROR('D.6 KP'!$W$35,\"-\")","v":0.5159619023902946},{"$f":"IFERROR('D.6 KP'!$W$36,\"-\")","v":0.53151006001680168},{"$f":"IFERROR((F39-C39)/C39*100,\"-\")","v":14.139860334750349},{"$f":"IFERROR((F39-D39)/D39*100,\"-\")","v":10.815794853935262},3.0134313317470127]

{"sheet":"7. MS","index":10,"n_rows":51,"n_cols":11,"rows_kept":51,"cut":false,"hidden":false,"merged":[[21,1,22,1],[17,0,22,0],[17,1,20,1],[46,0,50,0],[46,1,50,1],[39,1,44,1],[39,0,44,0],[24,1,29,1],[30,1,32,1],[33,1,37,1],[24,0,37,0]]}
[null,null,null,null,null,null,null,null,{"$f":"Codierung!I184","v":"Eidgenössisches Departement für  Wirtschaft, Bildung und Forschung WBF"}]
[null,null,null,null,null,null,null,null,{"$f":"Codierung!I185","v":"Bundesamt für Landwirtschaft BLW"}]
[null,null,null,null,null,null,null,null,{"$f":"Codierung!I186","v":"Fachbereich Marktanalysen"}]
[]
[]
[{"$f":"Codierung!$I$177","v":"Marktstruktur"},null,null,null,null,null,null,null,{"$f":"Codierung!$I$242","v":"Anmerkungen:"}]
[{"$f":"Codierung!$I$224","v":"in %"},null,null,null,null,null,null,null,"(1)",{"$f":"Codierung!$I$248","v":"Erweiterung der Datenerhebungen bei den Sammelstellen"}]
[{"$f":"Codierung!$I$222","v":"in Mio. Stück"},null,null,null,null,null,null,null,"(2)",{"$f":"Codierung!$I$255","v":"Verarbeitungseier (oft aus Bodenhaltung) direkt für die Industrie werden in der Erhebung Sammelstellen tendenziell unterproportional einbezogen"}]
[null,null,null,null,null,null,null,null,"(3)",{"$f":"Codierung!$I$90","v":"Anteile anhand des linearen Angebots im Verkaufsregal. Die Anteile zeigen nicht die effektiven Absatzanteile (z.B. Importeier werden überschätzt). Effektive Absatzanteile lassen sich mit Absatzzahlen von NielsenIQ Switzerland berechnen."}]
[{"$f":"Codierung!$I$211","v":"Quellen: BLW, Fachbereich Marktanalysen; Aviforum; NielsenIQ Switzerland, Total Market Consumer/Retail Panel; Grossopanel AG, Stans"},null,null,null,null,null,null,null,"(4)",{"$f":"Codierung!$I$100","v":"Absätze anhand NielsenIQ Switzerland, Total Market Consumer/Retail Panel; Kalkulation Fachbereich Marktanalysen BLW"}]
[{"$f":"Codierung!I215","v":"Publikationsrecht: Weiterverarbeitung und Publikation unter Quellenangabe gestattet."},null,null,null,null,null,null,null,"(5)",{"$f":"Codierung!$I$251","v":"Umrechnungsfaktoren: Eiprodukte getrocknet 80 Eier / kg; Eiprodukte flüssig 20.58 Eier / kg; Schaleneier 16.6 Eier / kg"}]
[null,null,null,null,null,null,null,null,"(6)",{"$f":"Codierung!$I$262","v":"Ab 2019 wurde die Konsumentenpreiserhebung erweitert. Der Verbrauchermarkt ist nun mit zwei Akteuren in der Erhebung vertreten. Die Preise blieben konstant."}]
[null,null,null,null,null,null,null,null,null,{"$f":"Codierung!$I$238","v":"Daten Import"}]
[null,null,null,null,null,null,null,null,{"$f":"Codierung!$I$256","v":"Aufbereitete Grafiken unterhalb der Datentabellen"}]
[{"$f":"Codierung!$I$154","v":"Zurück zum Inhaltsverzeichnis"}]
[null,null,null,null,{"$f":"Codierung!$I$252&'D.7 MS'!$A$18&\"-\"&'D.7 MS'!$A$22","v":"Ø 2001-2005"},{"$f":"Codierung!$I$252&'D.7 MS'!$A$23&\"-\"&'D.7 MS'!$A$27","v":"Ø 2006-2010"},{"$f":"'D.7 MS'!A$38","v":2021},{"$f":"'D.7 MS'!A$39","v":2022},{"$f":"Codierung!$J$237&\" \"&E16","v":"%-∆ Ø 2001-2005"},{"$f":"Codierung!$J$237&\" \"&F16","v":"%-∆ Ø 2006-2010"},{"$f":"Codierung!$I$233","v":"%-∆ Vorjahr"}]
[]
[{"$f":"Codierung!$I$70","v":"Produktion Inland"},{"$f":"Codierung!$I$91","v":"Erhebung Sammelstellen"},{"$f":"Codierung!$I$9","v":"Bio"},{"$f":"Codierung!$I$224","v":"in %"},{"$f":"IFERROR(AVERAGE('D.7 MS'!$B$18:$B$22),\"-\")","v":0.13675911870994367},{"$f":"IFERROR(AVERAGE('D.7 MS'!$B$23:$B$27),\"-\")","v":0.17460734505669276},{"$f":"IFERROR('D.7 MS'!$B$38,\"-\")","v":0.26910963606773874},{"$f":"IFERROR('D.7 MS'!$B$39,\"-\")","v":0.25758478080964009},{"$f":"IFERROR((H18-E18)/E18*100,\"-\")","v":88.349254689158258},{"$f":"IFERROR((H18-F18)/F18*100,\"-\")","v":47.522305390993502},{"$f":"IFERROR((H18-G18)/G18*100,\"-\")","v":-4.2825873597471933}]
[null,null,{"$f":"Codierung!$I$10","v":"Bodenhaltung"},{"$f":"Codierung!$I$224","v":"in %"},{"$f":"IFERROR(AVERAGE('D.7 MS'!$C$18:$C$22),\"-\")","v":0.41271555192181386},{"$f":"IFERROR(AVERAGE('D.7 MS'!$C$23:$C$27),\"-\")","v":0.29096587591054912},{"$f":"IFERROR('D.7 MS'!$C$38,\"-\")","v":0.10290088397274945},{"$f":"IFERROR('D.7 MS'!$C$39,\"-\")","v":9.226867037339119E-2},-77.643519866469461,-68.288834529256931,-10.332480333379756]
[null,null,{"$f":"Codierung!$I$11","v":"Freilandhaltung"},{"$f":"Codierung!$I$224","v":"in %"},{"$f":"IFERROR(AVERAGE('D.7 MS'!$D$18:$D$22),\"-\")","v":0.45052532936824247},{"$f":"IFERROR(AVERAGE('D.7 MS'!$D$23:$D$27),\"-\")","v":0.53442677903275804},{"$f":"IFERROR('D.7 MS'!$D$38,\"-\")","v":0.62798947995951182},{"$f":"IFERROR('D.7 MS'!$D$39,\"-\")","v":0.65014654881696865},44.308545255080055,21.653063492373668,{"$f":"IFERROR((H20-G20)/G20*100,\"-\")","v":3.5282547820522971}]
[null,null,{"$f":"Codierung!$I$93","v":"Abdeckung durch Erhebung (2)"},{"$f":"Codierung!$I$224","v":"in %"},{"$f":"IFERROR(AVERAGE('D.7 MS'!$E$18:$E$22),\"-\")","v":0.44440494906837474},{"$f":"IFERROR(AVERAGE('D.7 MS'!$E$23:$E$27),\"-\")","v":0.5101203352401984},{"$f":"IFERROR('D.7 MS'!$E$38,\"-\")","v":0.61835583524826465},{"$f":"IFERROR('D.7 MS'!$E$39,\"-\")","v":0.60027734140570299},35.074405148747836,17.673674217094817,-2.923639240066894]
[null,{"$f":"Codierung!$I$92","v":"Produktion Total (aus Kükenstatistik)"},{"$f":"Codierung!$I$9","v":"Bio"},{"$f":"Codierung!$I$224","v":"in %"},{"$f":"IFERROR(AVERAGE('D.7 MS'!$F$18:$F$22),\"-\")","v":"-"},{"$f":"IFERROR(AVERAGE('D.7 MS'!$F$23:$F$27),\"-\")","v":"-"},{"$f":"IFERROR('D.7 MS'!$F$38,\"-\")","v":0.19080675127293545},{"$f":"IFERROR('D.7 MS'!$F$39,\"-\")","v":0.19759062688645398},"-","-",3.5553645603528388]
[null,null,{"$f":"Codierung!$I$94","v":"Boden- und Freilandhaltung"},{"$f":"Codierung!$I$224","v":"in %"},{"$f":"IFERROR(AVERAGE('D.7 MS'!$G$18:$G$22),\"-\")","v":"-"},{"$f":"IFERROR(AVERAGE('D.7 MS'!$G$23:$G$27),\"-\")","v":"-"},{"$f":"IFERROR('D.7 MS'!$G$38,\"-\")","v":0.80919324872706455},{"$f":"IFERROR('D.7 MS'!$G$39,\"-\")","v":0.80240937311354599},"-","-",-0.83835049590320043]
[]
[{"$f":"Codierung!$I$86","v":"Liefer- und Abholgrosshandel"},{"$f":"Codierung!$I$28","v":"Schaleneier"},{"$f":"Codierung!$I$9","v":"Bio"},{"$f":"Codierung!$I$224","v":"in %"},{"$f":"IFERROR(AVERAGE('D.7 MS'!$H$18:$H$22),\"-\")","v":"-"},{"$f":"IFERROR(AVERAGE('D.7 MS'!$H$23:$H$27),\"-\")","v":"-"},{"$f":"IFERROR('D.7 MS'!$H$38,\"-\")","v":3.2512926554960166E-2},{"$f":"IFERROR('D.7 MS'!$H$39,\"-\")","v":2.6309195283356387E-2},{"$f":"IFERROR((H25-E25)/E25*100,\"-\")","v":"-"},{"$f":"IFERROR((H25-F25)/F25*100,\"-\")","v":"-"},-19.080814706473532]
[null,null,{"$f":"Codierung!$I$10","v":"Bodenhaltung"},{"$f":"Codierung!$I$224","v":"in %"},{"$f":"IFERROR(AVERAGE('D.7 MS'!$I$18:$I$22),\"-\")","v":"-"},{"$f":"IFERROR(AVERAGE('D.7 MS'!$I$23:$I$27),\"-\")","v":"-"},{"$f":"IFERROR('D.7 MS'!$I$38,\"-\")","v":0.59918789885210133},{"$f":"IFERROR('D.7 MS'!$I$39,\"-\")","v":0.61746175302446815},"-","-",{"$f":"IFERROR((H26-G26)/G26*100,\"-\")","v":3.049770231904732}]
[null,null,{"$f":"Codierung!$I$11","v":"Freilandhaltung"},{"$f":"Codierung!$I$224","v":"in %"},{"$f":"IFERROR(AVERAGE('D.7 MS'!$J$18:$J$22),\"-\")","v":"-"},{"$f":"IFERROR(AVERAGE('D.7 MS'!$J$23:$J$27),\"-\")","v":"-"},{"$f":"IFERROR('D.7 MS'!$J$38,\"-\")","v":0.36829917459293848},{"$f":"IFERROR('D.7 MS'!$J$39,\"-\")","v":0.35622905169217556},"-","-",-3.2772603723870386]
[null,null,{"$f":"Codierung!$I$98","v":"Anteil Inland"},{"$f":"Codierung!$I$224","v":"in %"},{"$f":"IFERROR(AVERAGE('D.7 MS'!$K$18:$K$22),\"-\")","v":"-"},{"$f":"IFERROR(AVERAGE('D.7 MS'!$K$23:$K$27),\"-\")","v":"-"},{"$f":"IFERROR('D.7 MS'!$K$38,\"-\")","v":0.5193037043423322},{"$f":"IFERROR('D.7 MS'!$K$39,\"-\")","v":0.51456617078273992},"-","-",-0.91228572412979159]
[null,null,{"$f":"Codierung!$I$99","v":"Anteil Import"},{"$f":"Codierung!$I$224","v":"in %"},{"$f":"IFERROR(AVERAGE('D.7 MS'!$L$18:$L$22),\"-\")","v":"-"},{"$f":"IFERROR(AVERAGE('D.7 MS'!$L$23:$L$27),\"-\")","v":"-"},{"$f":"IFERROR('D.7 MS'!$L$38,\"-\")","v":0.47860535874651622},{"$f":"IFERROR('D.7 MS'!$L$39,\"-\")","v":0.48236284151281178},"-",{"$f":"IFERROR((H29-F29)/F29*100,\"-\")","v":"-"},{"$f":"IFERROR((H29-G29)/G29*100,\"-\")","v":0.78508999066298313}]
[null,null,{"$f":"Codierung!$I$95","v":"ohne Angabe"},{"$f":"Codierung!$I$224","v":"in %"},{"$f":"IFERROR(AVERAGE('D.7 MS'!$M$18:$M$22),\"-\")","v":"-"},{"$f":"IFERROR(AVERAGE('D.7 MS'!$M$23:$M$27),\"-\")","v":"-"},{"$f":"IFERROR('D.7 MS'!$M$38,\"-\")","v":2.0909369111515967E-3},{"$f":"IFERROR('D.7 MS'!$M$39,\"-\")","v":3.0709877044482912E-3},"-","-",46.871370822801403]
[null,{"$f":"Codierung!$I$29","v":"Eiprodukte (5)"},{"$f":"Codierung!$I$98","v":"Anteil Inland"},{"$f":"Codierung!$I$224","v":"in %"},{"$f":"IFERROR(AVERAGE('D.7 MS'!$N$18:$N$22),\"-\")","v":"-"},{"$f":"IFERROR(AVERAGE('D.7 MS'!$N$23:$N$27),\"-\")","v":"-"},{"$f":"IFERROR('D.7 MS'!$N$38,\"-\")","v":0.2795828508480081},{"$f":"IFERROR('D.7 MS'!$N$39,\"-\")","v":0.28266234357014097},"-","-",1.1014598044166164]
[null,null,{"$f":"Codierung!$I$99","v":"Anteil Import"},{"$f":"Codierung!$I$224","v":"in %"},{"$f":"IFERROR(AVERAGE('D.7 MS'!$O$18:$O$22),\"-\")","v":"-"},{"$f":"IFERROR(AVERAGE('D.7 MS'!$O$23:$O$27),\"-\")","v":"-"},{"$f":"IFERROR('D.7 MS'!$O$38,\"-\")","v":0.45808178078664069},{"$f":"IFERROR('D.7 MS'!$O$39,\"-\")","v":0.44221957768733555},"-","-",-3.4627448120869984]
[null,null,{"$f":"Codierung!$I$95","v":"ohne Angabe"},{"$f":"Codierung!$I$224","v":"in %"},{"$f":"IFERROR(AVERAGE('D.7 MS'!$P$18:$P$22),\"-\")","v":"-"},{"$f":"IFERROR(AVERAGE('D.7 MS'!$P$23:$P$27),\"-\")","v":"-"},{"$f":"IFERROR('D.7 MS'!$P$38,\"-\")","v":0.26233536836535121},{"$f":"IFERROR('D.7 MS'!$P$39,\"-\")","v":0.27511807874252359},"-","-",4.8726599302348195]
[null,{"$f":"Codierung!$I$36","v":"Total"},{"$f":"Codierung!$I$98","v":"Anteil Inland"},{"$f":"Codierung!$I$224","v":"in %"},{"$f":"IFERROR(AVERAGE('D.7 MS'!$Q$18:$Q$22),\"-\")","v":"-"},{"$f":"IFERROR(AVERAGE('D.7 MS'!$Q$23:$Q$27),\"-\")","v":"-"},{"$f":"IFERROR('D.7 MS'!$Q$38,\"-\")","v":0.3835173925090829},{"$f":"IFERROR('D.7 MS'!$Q$39,\"-\")","v":0.38181799621670037},"-","-",-0.44310801167701402]
[null,null,{"$f":"Codierung!$I$99","v":"Anteil Import"},{"$f":"Codierung!$I$224","v":"in %"},{"$f":"IFERROR(AVERAGE('D.7 MS'!$R$18:$R$22),\"-\")","v":"-"},{"$f":"IFERROR(AVERAGE('D.7 MS'!$R$23:$R$27),\"-\")","v":"-"},{"$f":"IFERROR('D.7 MS'!$R$38,\"-\")","v":0.46698008328060997},{"$f":"IFERROR('D.7 MS'!$R$39,\"-\")","v":0.45938372530758598},"-","-",-1.6266984920766554]
[null,null,{"$f":"Codierung!$I$95","v":"ohne Angabe"},{"$f":"Codierung!$I$224","v":"in %"},{"$f":"IFERROR(AVERAGE('D.7 MS'!$S$18:$S$22),\"-\")","v":"-"},{"$f":"IFERROR(AVERAGE('D.7 MS'!$S$23:$S$27),\"-\")","v":"-"},{"$f":"IFERROR('D.7 MS'!$S$38,\"-\")","v":0.14950252421030702},{"$f":"IFERROR('D.7 MS'!$S$39,\"-\")","v":0.15879827847571368},"-","-",6.2177908463473219]
[null,null,{"$f":"Codierung!$I$28","v":"Schaleneier"},{"$f":"Codierung!$I$224","v":"in %"},{"$f":"IFERROR(AVERAGE('D.7 MS'!$T$18:$T$22),\"-\")","v":"-"},{"$f":"IFERROR(AVERAGE('D.7 MS'!$T$23:$T$27),\"-\")","v":"-"},{"$f":"IFERROR('D.7 MS'!$T$38,\"-\")","v":0.43356487408608246},{"$f":"IFERROR('D.7 MS'!$T$39,\"-\")","v":0.42757229942418301},"-","-",-1.3821633208943149]
[null,null,{"$f":"Codierung!$I$29","v":"Eiprodukte (5)"},{"$f":"Codierung!$I$224","v":"in %"},{"$f":"IFERROR(AVERAGE('D.7 MS'!$U$18:$U$22),\"-\")","v":"-"},{"$f":"IFERROR(AVERAGE('D.7 MS'!$U$23:$U$27),\"-\")","v":"-"},{"$f":"IFERROR('D.7 MS'!$U$38,\"-\")","v":0.56643512591391743},{"$f":"IFERROR('D.7 MS'!$U$39,\"-\")","v":0.57242770057581693},"-","-",1.0579454535469988]
[]
[{"$f":"Codierung!$I$88","v":"Detailhandel (3)"},{"$f":"Codierung!$I$28","v":"Schaleneier"},{"$f":"Codierung!$I$9","v":"Bio"},{"$f":"Codierung!$I$224","v":"in %"},{"$f":"IFERROR(AVERAGE('D.7 MS'!$V$18:$V$22),\"-\")","v":0.13203095824743083},{"$f":"IFERROR(AVERAGE('D.7 MS'!$V$23:$V$27),\"-\")","v":0.17536094885607084},{"$f":"IFERROR('D.7 MS'!$V$38,\"-\")","v":0.23718641973012672},{"$f":"IFERROR('D.7 MS'!$V$39,\"-\")","v":0.25748943132490687},{"$f":"IFERROR((H40-E40)/E40*100,\"-\")","v":95.022012066565694},{"$f":"IFERROR((H40-F40)/F40*100,\"-\")","v":46.833963322269518},8.5599384728186116]
[null,null,{"$f":"Codierung!$I$10","v":"Bodenhaltung"},{"$f":"Codierung!$I$224","v":"in %"},{"$f":"IFERROR(AVERAGE('D.7 MS'!$W$18:$W$22),\"-\")","v":0.50549404864133141},{"$f":"IFERROR(AVERAGE('D.7 MS'!$W$23:$W$27),\"-\")","v":0.49358138219048603},{"$f":"IFERROR('D.7 MS'!$W$38,\"-\")","v":0.20780910657110607},{"$f":"IFERROR('D.7 MS'!$W$39,\"-\")","v":0.18143901149170344},-64.106597895786138,-63.240304833523609,-12.689576272433264]
[null,null,{"$f":"Codierung!$I$11","v":"Freilandhaltung"},{"$f":"Codierung!$I$224","v":"in %"},{"$f":"IFERROR(AVERAGE('D.7 MS'!$X$18:$X$22),\"-\")","v":0.31692240079696743},{"$f":"IFERROR(AVERAGE('D.7 MS'!$X$23:$X$27),\"-\")","v":0.32474135229544421},{"$f":"IFERROR('D.7 MS'!$X$38,\"-\")","v":0.55500447369876682},{"$f":"IFERROR('D.7 MS'!$X$39,\"-\")","v":0.56107155718338964},77.037519522904745,72.774903232199449,1.0931593837774671]
[null,null,{"$f":"Codierung!$I$80","v":"Bodenhaltung Import"},{"$f":"Codierung!$I$224","v":"in %"},{"$f":"IFERROR(AVERAGE('D.7 MS'!$Y$18:$Y$22),\"-\")","v":0.19885225372816479},{"$f":"IFERROR(AVERAGE('D.7 MS'!$Y$23:$Y$27),\"-\")","v":0.2086181433002125},{"$f":"IFERROR('D.7 MS'!$Y$38,\"-\")","v":0.33168442550342048},{"$f":"IFERROR('D.7 MS'!$Y$39,\"-\")","v":0.29167445211064275},46.67897730209679,39.812600906388013,-12.062662674634728]
[null,null,{"$f":"Codierung!$I$98","v":"Anteil Inland"},{"$f":"Codierung!$I$224","v":"in %"},{"$f":"IFERROR(AVERAGE('D.7 MS'!$Z$18:$Z$22),\"-\")","v":0.80114774627183516},{"$f":"IFERROR(AVERAGE('D.7 MS'!$Z$23:$Z$27),\"-\")","v":0.79138185669978756},{"$f":"IFERROR('D.7 MS'!$Z$38,\"-\")","v":0.6683155744965793},{"$f":"IFERROR('D.7 MS'!$Z$39,\"-\")","v":0.70832554788935698},-11.586152343862794,-10.495098934513249,5.9866887619543965]
[null,null,{"$f":"Codierung!$I$99","v":"Anteil Import"},{"$f":"Codierung!$I$224","v":"in %"},{"$f":"IFERROR(AVERAGE('D.7 MS'!$AA$18:$AA$22),\"-\")","v":0.19885225372816479},{"$f":"IFERROR(AVERAGE('D.7 MS'!$AA$23:$AA$27),\"-\")","v":0.2086181433002125},{"$f":"IFERROR('D.7 MS'!$AA$38,\"-\")","v":0.33168442550342048},{"$f":"IFERROR('D.7 MS'!$AA$39,\"-\")","v":0.29167445211064275},46.67897730209679,39.812600906388013,-12.062662674634728]
[]
[{"$f":"Codierung!$I$89","v":"Detailhandel (4)"},{"$f":"Codierung!$I$28","v":"Schaleneier"},{"$f":"Codierung!$I$36","v":"Total"},{"$f":"Codierung!$I$222","v":"in Mio. Stück"},{"$f":"IFERROR(AVERAGE('D.7 MS'!$AB$18:$AB$22),\"-\")","v":"-"},{"$f":"IFERROR(AVERAGE('D.7 MS'!$AB$23:$AB$27),\"-\")","v":"-"},{"$f":"IFERROR('D.7 MS'!$AB$38,\"-\")","v":907.41105645610594},{"$f":"IFERROR('D.7 MS'!$AB$39,\"-\")","v":856.82049562136035},{"$f":"IFERROR((H47-E47)/E47*100,\"-\")","v":"-"},{"$f":"IFERROR((H47-F47)/F47*100,\"-\")","v":"-"},{"$f":"IFERROR((H47-G47)/G47*100,\"-\")","v":-5.5752638757044721}]
[null,null,{"$f":"Codierung!$I$9","v":"Bio"},{"$f":"Codierung!$I$222","v":"in Mio. Stück"},{"$f":"IFERROR(AVERAGE('D.7 MS'!$AC$18:$AC$22),\"-\")","v":"-"},{"$f":"IFERROR(AVERAGE('D.7 MS'!$AC$23:$AC$27),\"-\")","v":"-"},{"$f":"IFERROR('D.7 MS'!$AC$38,\"-\")","v":158.55124759999998},{"$f":"IFERROR('D.7 MS'!$AC$39,\"-\")","v":156.29408470000001},{"$f":"IFERROR((H48-E48)/E48*100,\"-\")","v":"-"},{"$f":"IFERROR((H48-F48)/F48*100,\"-\")","v":"-"},-1.4236172431102139]
[null,null,{"$f":"Codierung!$I$10","v":"Bodenhaltung"},{"$f":"Codierung!$I$222","v":"in Mio. Stück"},{"$f":"IFERROR(AVERAGE('D.7 MS'!$AD$18:$AD$22),\"-\")","v":"-"},{"$f":"IFERROR(AVERAGE('D.7 MS'!$AD$23:$AD$27),\"-\")","v":"-"},{"$f":"IFERROR('D.7 MS'!$AD$38,\"-\")","v":218.54802449437076},{"$f":"IFERROR('D.7 MS'!$AD$39,\"-\")","v":201.66253519332966},{"$f":"IFERROR((H49-E49)/E49*100,\"-\")","v":"-"},{"$f":"IFERROR((H49-F49)/F49*100,\"-\")","v":"-"},-7.7262145654746153]
[null,null,{"$f":"Codierung!$I$11","v":"Freilandhaltung"},{"$f":"Codierung!$I$222","v":"in Mio. Stück"},{"$f":"IFERROR(AVERAGE('D.7 MS'!$AE$18:$AE$22),\"-\")","v":"-"},{"$f":"IFERROR(AVERAGE('D.7 MS'!$AE$23:$AE$27),\"-\")","v":"-"},{"$f":"IFERROR('D.7 MS'!$AE$38,\"-\")","v":281.13458226173537},{"$f":"IFERROR('D.7 MS'!$AE$39,\"-\")","v":271.13150932803046},{"$f":"IFERROR((H50-E50)/E50*100,\"-\")","v":"-"},{"$f":"IFERROR((H50-F50)/F50*100,\"-\")","v":"-"},-3.5581083099880209]
[null,null,{"$f":"Codierung!$I$45","v":"Import"},{"$f":"Codierung!$I$222","v":"in Mio. Stück"},{"$f":"IFERROR(AVERAGE('D.7 MS'!$AF$18:$AF$22),\"-\")","v":"-"},{"$f":"IFERROR(AVERAGE('D.7 MS'!$AF$23:$AF$27),\"-\")","v":"-"},{"$f":"IFERROR('D.7 MS'!$AF$38,\"-\")","v":249.17720209999996},{"$f":"IFERROR('D.7 MS'!$AF$39,\"-\")","v":227.7323664000001},{"$f":"IFERROR((H51-E51)/E51*100,\"-\")","v":"-"},{"$f":"IFERROR((H51-F51)/F51*100,\"-\")","v":"-"},-8.6062591277486131]

{"sheet":"8. BWS","index":11,"n_rows":55,"n_cols":10,"rows_kept":55,"cut":false,"hidden":false,"merged":[[14,1,17,1],[35,0,54,0],[14,0,33,0],[51,1,54,1],[47,1,50,1],[43,1,46,1],[39,1,42,1],[35,1,38,1],[30,1,33,1],[26,1,29,1],[22,1,25,1],[18,1,21,1]]}
[null,null,null,null,{"$f":"Codierung!I184","v":"Eidgenössisches Departement für  Wirtschaft, Bildung und Forschung WBF"}]
[null,null,null,null,{"$f":"Codierung!I185","v":"Bundesamt für Landwirtschaft BLW"}]
[null,null,null,null,{"$f":"Codierung!I186","v":"Fachbereich Marktanalysen"}]
[]
[]
[{"$f":"Codierung!I180","v":"Bruttowertschöpfung"},null,null,null,{"$f":"Codierung!$I$242","v":"Anmerkungen:"}]
[{"$f":"Codierung!I217","v":"in CHF / Ei"},null,null,null,"(1)",{"$f":"Codierung!$I$248","v":"Erweiterung der Datenerhebungen bei den Sammelstellen"}]
[{"$f":"Codierung!I224","v":"in %"},null,null,null,null,{"$f":"Codierung!$I$238","v":"Daten Import"}]
[{"$f":"Codierung!I207","v":"Quellen: BLW, Fachbereich Marktanalysen; Grossopanel AG, Stans"},null,null,null,null,{"$f":"Codierung!$I$256","v":"Aufbereitete Grafiken unterhalb der Datentabellen"}]
[{"$f":"Codierung!I215","v":"Publikationsrecht: Weiterverarbeitung und Publikation unter Quellenangabe gestattet."}]
[]
[{"$f":"Codierung!$I$154","v":"Zurück zum Inhaltsverzeichnis"}]
[{"$f":"Codierung!$I$253","v":"Informationen zur Methodik"},null,null,{"$f":"Codierung!$I$252&'D.8 BWS'!$A$17&\"-\"&'D.8 BWS'!$A$21","v":"Ø 2001-2005"},{"$f":"Codierung!$I$252&'D.8 BWS'!$A$22&\"-\"&'D.8 BWS'!$A$26","v":"Ø 2006-2010"},{"$f":"'D.8 BWS'!$A$37","v":2021},{"$f":"'D.8 BWS'!$A$38","v":2022},{"$f":"Codierung!$J$237&\" \"&D13","v":"%-∆ Ø 2001-2005"},{"$f":"Codierung!$J$237&\" \"&E13","v":"%-∆ Ø 2006-2010"},{"$f":"Codierung!$I$233","v":"%-∆ Vorjahr"}]
[]
[{"$f":"Codierung!$I$14","v":"Verarbeitung und Verteilung"},{"$f":"Codierung!$I$9","v":"Bio"},{"$f":"Codierung!$I$2","v":"Einstandspreis "},{"$f":"IFERROR(AVERAGE('D.8 BWS'!$B$17:$B$21),\"-\")","v":0.42257737244892624},{"$f":"IFERROR(AVERAGE('D.8 BWS'!$B$22:$B$26),\"-\")","v":0.411893003726232},{"$f":"IFERROR('D.8 BWS'!$B$37,\"-\")","v":0.44305007828859461},{"$f":"IFERROR('D.8 BWS'!$B$38,\"-\")","v":0.43917833837639869},{"$f":"IFERROR((G15-D15)/D15*100,\"-\")","v":3.9285032776994919},{"$f":"IFERROR((G15-E15)/E15*100,\"-\")","v":6.624374389301865},{"$f":"IFERROR((G15-F15)/F15*100,\"-\")","v":-0.87388313464509437}]
[null,null,{"$f":"Codierung!$I$3","v":"Nettoeinnahmen "},{"$f":"IFERROR(AVERAGE('D.8 BWS'!$C$17:$C$21),\"-\")","v":0.825978839600916},{"$f":"IFERROR(AVERAGE('D.8 BWS'!$C$22:$C$26),\"-\")","v":0.84101400839676954},{"$f":"IFERROR('D.8 BWS'!$C$37,\"-\")","v":0.82919276682180387},{"$f":"IFERROR('D.8 BWS'!$C$38,\"-\")","v":0.80931606561055458},-2.0173366666889785,-3.7690148403878498,{"$f":"IFERROR((G16-F16)/F16*100,\"-\")","v":-2.3971146404754946}]
[null,null,{"$f":"Codierung!$I$4","v":"Bruttowertschöpfung"},{"$f":"IFERROR(AVERAGE('D.8 BWS'!$D$17:$D$21),\"-\")","v":0.40340146715198982},{"$f":"IFERROR(AVERAGE('D.8 BWS'!$D$22:$D$26),\"-\")","v":0.42912100467053732},{"$f":"IFERROR('D.8 BWS'!$D$37,\"-\")","v":0.38614268853320938},{"$f":"IFERROR('D.8 BWS'!$D$38,\"-\")","v":0.37013772723415589},-8.245815304707639,-13.745138735790045,-4.1448308551042308]
[null,null,{"$f":"Codierung!$I$5","v":"Produzentenpreisanteil am Konsumentenfranken"},{"$f":"IFERROR(AVERAGE('D.8 BWS'!$E$17:$E$21),\"-\")","v":0.51627632107902333},{"$f":"IFERROR(AVERAGE('D.8 BWS'!$E$22:$E$26),\"-\")","v":0.48990542360744316},{"$f":"IFERROR('D.8 BWS'!$E$37,\"-\")","v":0.53435290652774392},{"$f":"IFERROR('D.8 BWS'!$E$38,\"-\")","v":0.54271069651917581},5.1201990796138661,10.778666731814964,1.5640955423525789]
[null,{"$f":"Codierung!$I$10","v":"Bodenhaltung"},{"$f":"Codierung!$I$2","v":"Einstandspreis "},{"$f":"IFERROR(AVERAGE('D.8 BWS'!$F$17:$F$21),\"-\")","v":0.2459532685350958},{"$f":"IFERROR(AVERAGE('D.8 BWS'!$F$22:$F$26),\"-\")","v":0.23076578809903667},{"$f":"IFERROR('D.8 BWS'!$F$37,\"-\")","v":0.20971738929447212},{"$f":"IFERROR('D.8 BWS'!$F$38,\"-\")","v":0.20871089657597575},-15.142052057667952,-9.5572622375010496,-0.4799281174929737]
[null,null,{"$f":"Codierung!$I$3","v":"Nettoeinnahmen "},{"$f":"IFERROR(AVERAGE('D.8 BWS'!$G$17:$G$21),\"-\")","v":0.52908713178143763},{"$f":"IFERROR(AVERAGE('D.8 BWS'!$G$22:$G$26),\"-\")","v":0.51459057341965742},{"$f":"IFERROR('D.8 BWS'!$G$37,\"-\")","v":0.45488350431448216},{"$f":"IFERROR('D.8 BWS'!$G$38,\"-\")","v":0.42912786554174215},-18.892779702113032,-16.607903893377184,-5.6620296248276203]
[null,null,{"$f":"Codierung!$I$4","v":"Bruttowertschöpfung"},{"$f":"IFERROR(AVERAGE('D.8 BWS'!$H$17:$H$21),\"-\")","v":0.28313386324634193},{"$f":"IFERROR(AVERAGE('D.8 BWS'!$H$22:$H$26),\"-\")","v":0.28382478532062072},{"$f":"IFERROR('D.8 BWS'!$H$37,\"-\")","v":0.24516611502001004},{"$f":"IFERROR('D.8 BWS'!$H$38,\"-\")","v":0.22041696896576637},-22.150969001545544,-22.340478927245957,-10.094847753419629]
[null,null,{"$f":"Codierung!$I$5","v":"Produzentenpreisanteil am Konsumentenfranken"},{"$f":"IFERROR(AVERAGE('D.8 BWS'!$I$17:$I$21),\"-\")","v":0.48750361712431295},{"$f":"IFERROR(AVERAGE('D.8 BWS'!$I$22:$I$26),\"-\")","v":0.38075164221960994},{"$f":"IFERROR('D.8 BWS'!$I$37,\"-\")","v":0.37188105210051708},{"$f":"IFERROR('D.8 BWS'!$I$38,\"-\")","v":0.39261278183391218},-19.464642303608528,3.1151906647485901,5.5748281920508935]
[null,{"$f":"Codierung!$I$11","v":"Freilandhaltung"},{"$f":"Codierung!$I$2","v":"Einstandspreis "},{"$f":"IFERROR(AVERAGE('D.8 BWS'!$J$17:$J$21),\"-\")","v":0.27875485603550004},{"$f":"IFERROR(AVERAGE('D.8 BWS'!$J$22:$J$26),\"-\")","v":0.24813967586209387},{"$f":"IFERROR('D.8 BWS'!$J$37,\"-\")","v":0.22443971662058146},{"$f":"IFERROR('D.8 BWS'!$J$38,\"-\")","v":0.2263301251187203},-18.806750727995688,-8.7892235159904235,0.84227895427911648]
[null,null,{"$f":"Codierung!$I$3","v":"Nettoeinnahmen "},{"$f":"IFERROR(AVERAGE('D.8 BWS'!$K$17:$K$21),\"-\")","v":0.60737158539466363},{"$f":"IFERROR(AVERAGE('D.8 BWS'!$K$22:$K$26),\"-\")","v":0.65230779934459338},{"$f":"IFERROR('D.8 BWS'!$K$37,\"-\")","v":0.6035269478220372},{"$f":"IFERROR('D.8 BWS'!$K$38,\"-\")","v":0.57680929781371948},-5.0318928833467069,-11.574060835502973,-4.4269191466486078]
[null,null,{"$f":"Codierung!$I$4","v":"Bruttowertschöpfung"},{"$f":"IFERROR(AVERAGE('D.8 BWS'!$L$17:$L$21),\"-\")","v":0.32861672935916353},{"$f":"IFERROR(AVERAGE('D.8 BWS'!$L$22:$L$26),\"-\")","v":0.40416812348249953},{"$f":"IFERROR('D.8 BWS'!$L$37,\"-\")","v":0.37908723120145571},{"$f":"IFERROR('D.8 BWS'!$L$38,\"-\")","v":0.35047917269499917},6.6528698579861292,-13.283816230951494,-7.5465634692542709]
[null,null,{"$f":"Codierung!$I$5","v":"Produzentenpreisanteil am Konsumentenfranken"},{"$f":"IFERROR(AVERAGE('D.8 BWS'!$M$17:$M$21),\"-\")","v":0.46639250122071774},{"$f":"IFERROR(AVERAGE('D.8 BWS'!$M$22:$M$26),\"-\")","v":0.44875998790321453},{"$f":"IFERROR('D.8 BWS'!$M$37,\"-\")","v":0.46119790203454097},{"$f":"IFERROR('D.8 BWS'!$M$38,\"-\")","v":0.48751199973519427},4.5282671696477044,8.635353613642021,5.7055978755693744]
[null,{"$f":"Codierung!$I$12","v":"Inland und Import"},{"$f":"Codierung!$I$2","v":"Einstandspreis "},{"$f":"IFERROR(AVERAGE('D.8 BWS'!$N$17:$N$21),\"-\")","v":0.20749147790973638},{"$f":"IFERROR(AVERAGE('D.8 BWS'!$N$22:$N$26),\"-\")","v":0.19890296885560063},{"$f":"IFERROR('D.8 BWS'!$N$37,\"-\")","v":0.21328418692686602},{"$f":"IFERROR('D.8 BWS'!$N$38,\"-\")","v":0.22317433465901135},7.5583136749825348,12.202616151512157,4.6370750099427722]
[null,null,{"$f":"Codierung!$I$3","v":"Nettoeinnahmen "},{"$f":"IFERROR(AVERAGE('D.8 BWS'!$O$17:$O$21),\"-\")","v":0.46140145671083888},{"$f":"IFERROR(AVERAGE('D.8 BWS'!$O$22:$O$26),\"-\")","v":0.43301564603445258},{"$f":"IFERROR('D.8 BWS'!$O$37,\"-\")","v":0.43856580166581799},{"$f":"IFERROR('D.8 BWS'!$O$38,\"-\")","v":0.46544018153638556},0.87531687791739166,7.4880748071983376,6.1277873852657416]
[null,null,{"$f":"Codierung!$I$4","v":"Bruttowertschöpfung"},{"$f":"IFERROR(AVERAGE('D.8 BWS'!$P$17:$P$21),\"-\")","v":0.25390997880110255},{"$f":"IFERROR(AVERAGE('D.8 BWS'!$P$22:$P$26),\"-\")","v":0.23411267717885192},{"$f":"IFERROR('D.8 BWS'!$P$37,\"-\")","v":0.22528161473895189},{"$f":"IFERROR('D.8 BWS'!$P$38,\"-\")","v":0.24226584687737418},-4.5859292252746275,3.4825835989623015,7.5391115063264253]
[null,null,{"$f":"Codierung!$I$5","v":"Produzentenpreisanteil am Konsumentenfranken"},{"$f":"IFERROR(AVERAGE('D.8 BWS'!$Q$17:$Q$21),\"-\")","v":0.4500073976950052},{"$f":"IFERROR(AVERAGE('D.8 BWS'!$Q$22:$Q$26),\"-\")","v":0.45945154171274594},{"$f":"IFERROR('D.8 BWS'!$Q$37,\"-\")","v":0.48710127358489469},{"$f":"IFERROR('D.8 BWS'!$Q$38,\"-\")","v":0.48010983136213414},6.6893197359237693,4.4962934659829683,-1.4353159398056961]
[null,{"$f":"Codierung!$I$13","v":"Konsumeier Import"},{"$f":"Codierung!$I$2","v":"Einstandspreis "},{"$f":"IFERROR(AVERAGE('D.8 BWS'!$R$17:$R$21),\"-\")","v":0.15309655174260245},{"$f":"IFERROR(AVERAGE('D.8 BWS'!$R$22:$R$26),\"-\")","v":0.15952361811266244},{"$f":"IFERROR('D.8 BWS'!$R$37,\"-\")","v":0.1360805496942748},{"$f":"IFERROR('D.8 BWS'!$R$38,\"-\")","v":0.14746737450977285},-3.6768804840841893,-7.5576543119621045,8.3677093023802769]
[null,null,{"$f":"Codierung!$I$3","v":"Nettoeinnahmen "},{"$f":"IFERROR(AVERAGE('D.8 BWS'!$S$17:$S$21),\"-\")","v":0.27908519229085821},{"$f":"IFERROR(AVERAGE('D.8 BWS'!$S$22:$S$26),\"-\")","v":0.33457662612495553},{"$f":"IFERROR('D.8 BWS'!$S$37,\"-\")","v":0.26027993883497752},{"$f":"IFERROR('D.8 BWS'!$S$38,\"-\")","v":0.26481831714892284},-5.1120143726818199,-20.849725751606989,1.7436527510569084]
[null,null,{"$f":"Codierung!$I$4","v":"Bruttowertschöpfung"},{"$f":"IFERROR(AVERAGE('D.8 BWS'!$T$17:$T$21),\"-\")","v":0.12598864054825576},{"$f":"IFERROR(AVERAGE('D.8 BWS'!$T$22:$T$26),\"-\")","v":0.17505300801229312},{"$f":"IFERROR('D.8 BWS'!$T$37,\"-\")","v":0.12419938914070276},{"$f":"IFERROR('D.8 BWS'!$T$38,\"-\")","v":0.11735094263915002},-6.855933893339655,-32.962624309255489,-5.5140742228565101]
[null,null,{"$f":"Codierung!$I$5","v":"Produzentenpreisanteil am Konsumentenfranken"},{"$f":"IFERROR(AVERAGE('D.8 BWS'!$U$17:$U$21),\"-\")","v":0.44832880641713263},{"$f":"IFERROR(AVERAGE('D.8 BWS'!$U$22:$U$26),\"-\")","v":0.47791063845980269},{"$f":"IFERROR('D.8 BWS'!$U$37,\"-\")","v":0.52329424134004665},{"$f":"IFERROR('D.8 BWS'!$U$38,\"-\")","v":0.55628960306949204},24.080718237835221,16.400338955057986,6.3053171854043732]
[]
[{"$f":"Codierung!$I$15","v":"Verarbeitung für Gastronomie / Ausserhausverpflegung "},{"$f":"Codierung!$I$9","v":"Bio"},{"$f":"Codierung!$I$2","v":"Einstandspreis "},{"$f":"IFERROR(AVERAGE('D.8 BWS'!$V$17:$V$21),\"-\")","v":"-"},{"$f":"IFERROR(AVERAGE('D.8 BWS'!$V$22:$V$26),\"-\")","v":"-"},{"$f":"IFERROR('D.8 BWS'!$V$37,\"-\")","v":0.44305007828859461},{"$f":"IFERROR('D.8 BWS'!$V$38,\"-\")","v":0.43917833837639869},{"$f":"IFERROR((G36-D36)/D36*100,\"-\")","v":"-"},{"$f":"IFERROR((G36-E36)/E36*100,\"-\")","v":"-"},{"$f":"IFERROR((G36-F36)/F36*100,\"-\")","v":-0.87388313464509437}]
[null,null,{"$f":"Codierung!$I$3","v":"Nettoeinnahmen "},{"$f":"IFERROR(AVERAGE('D.8 BWS'!$W$17:$W$21),\"-\")","v":"-"},{"$f":"IFERROR(AVERAGE('D.8 BWS'!$W$22:$W$26),\"-\")","v":"-"},{"$f":"IFERROR('D.8 BWS'!$W$37,\"-\")","v":0.71319743536220803},{"$f":"IFERROR('D.8 BWS'!$W$38,\"-\")","v":0.73499441976619984},"-","-",3.0562342660306787]
[null,null,{"$f":"Codierung!$I$4","v":"Bruttowertschöpfung"},{"$f":"IFERROR(AVERAGE('D.8 BWS'!$X$17:$X$21),\"-\")","v":"-"},{"$f":"IFERROR(AVERAGE('D.8 BWS'!$X$22:$X$26),\"-\")","v":"-"},{"$f":"IFERROR('D.8 BWS'!$X$37,\"-\")","v":0.27014735707361343},{"$f":"IFERROR('D.8 BWS'!$X$38,\"-\")","v":0.29581608138980109},"-","-",9.5017491913471144]
[null,null,{"$f":"Codierung!$I$6","v":"Produzentenpreisanteil am Gastronomenfranken"},{"$f":"IFERROR(AVERAGE('D.8 BWS'!$Y$17:$Y$21),\"-\")","v":"-"},{"$f":"IFERROR(AVERAGE('D.8 BWS'!$Y$22:$Y$26),\"-\")","v":"-"},{"$f":"IFERROR('D.8 BWS'!$Y$37,\"-\")","v":0.62189977192352042},{"$f":"IFERROR('D.8 BWS'!$Y$38,\"-\")","v":0.59777170852240746},"-","-",-3.8797350458073745]
[null,{"$f":"Codierung!$I$10","v":"Bodenhaltung"},{"$f":"Codierung!$I$2","v":"Einstandspreis "},{"$f":"IFERROR(AVERAGE('D.8 BWS'!$Z$17:$Z$21),\"-\")","v":"-"},{"$f":"IFERROR(AVERAGE('D.8 BWS'!$Z$22:$Z$26),\"-\")","v":"-"},{"$f":"IFERROR('D.8 BWS'!$Z$37,\"-\")","v":0.20971738929447212},{"$f":"IFERROR('D.8 BWS'!$Z$38,\"-\")","v":0.20871089657597575},"-","-",-0.4799281174929737]
[null,null,{"$f":"Codierung!$I$3","v":"Nettoeinnahmen "},{"$f":"IFERROR(AVERAGE('D.8 BWS'!$AA$17:$AA$21),\"-\")","v":"-"},{"$f":"IFERROR(AVERAGE('D.8 BWS'!$AA$22:$AA$26),\"-\")","v":"-"},{"$f":"IFERROR('D.8 BWS'!$AA$37,\"-\")","v":0.39178484462042845},{"$f":"IFERROR('D.8 BWS'!$AA$38,\"-\")","v":0.39812822353862692},"-","-",1.6190975749314922]
[null,null,{"$f":"Codierung!$I$4","v":"Bruttowertschöpfung"},{"$f":"IFERROR(AVERAGE('D.8 BWS'!$AB$17:$AB$21),\"-\")","v":"-"},{"$f":"IFERROR(AVERAGE('D.8 BWS'!$AB$22:$AB$26),\"-\")","v":"-"},{"$f":"IFERROR('D.8 BWS'!$AB$37,\"-\")","v":0.18206745532595628},{"$f":"IFERROR('D.8 BWS'!$AB$38,\"-\")","v":0.18941732696265112},"-","-",4.036894800081833]
[null,null,{"$f":"Codierung!$I$6","v":"Produzentenpreisanteil am Gastronomenfranken"},{"$f":"IFERROR(AVERAGE('D.8 BWS'!$AC$17:$AC$21),\"-\")","v":"-"},{"$f":"IFERROR(AVERAGE('D.8 BWS'!$AC$22:$AC$26),\"-\")","v":"-"},{"$f":"IFERROR('D.8 BWS'!$AC$37,\"-\")","v":0.53539297886679049},{"$f":"IFERROR('D.8 BWS'!$AC$38,\"-\")","v":0.52533993326521822},"-","-",-1.8776947024689212]
[null,{"$f":"Codierung!$I$11","v":"Freilandhaltung"},{"$f":"Codierung!$I$2","v":"Einstandspreis "},{"$f":"IFERROR(AVERAGE('D.8 BWS'!$AD$17:$AD$21),\"-\")","v":"-"},{"$f":"IFERROR(AVERAGE('D.8 BWS'!$AD$22:$AD$26),\"-\")","v":"-"},{"$f":"IFERROR('D.8 BWS'!$AD$37,\"-\")","v":0.22443971662058146},{"$f":"IFERROR('D.8 BWS'!$AD$38,\"-\")","v":0.2263301251187203},"-","-",0.84227895427911648]
[null,null,{"$f":"Codierung!$I$3","v":"Nettoeinnahmen "},{"$f":"IFERROR(AVERAGE('D.8 BWS'!$AE$17:$AE$21),\"-\")","v":"-"},{"$f":"IFERROR(AVERAGE('D.8 BWS'!$AE$22:$AE$26),\"-\")","v":"-"},{"$f":"IFERROR('D.8 BWS'!$AE$37,\"-\")","v":0.53365497838257325},{"$f":"IFERROR('D.8 BWS'!$AE$38,\"-\")","v":0.52534851015791284},"-","-",-1.5565240766301944]
[null,null,{"$f":"Codierung!$I$4","v":"Bruttowertschöpfung"},{"$f":"IFERROR(AVERAGE('D.8 BWS'!$AF$17:$AF$21),\"-\")","v":"-"},{"$f":"IFERROR(AVERAGE('D.8 BWS'!$AF$22:$AF$26),\"-\")","v":"-"},{"$f":"IFERROR('D.8 BWS'!$AF$37,\"-\")","v":0.30921526176199166},{"$f":"IFERROR('D.8 BWS'!$AF$38,\"-\")","v":0.29901838503919259},"-","-",-3.2976628206171066]
[null,null,{"$f":"Codierung!$I$6","v":"Produzentenpreisanteil am Gastronomenfranken"},{"$f":"IFERROR(AVERAGE('D.8 BWS'!$AG$17:$AG$21),\"-\")","v":"-"},{"$f":"IFERROR(AVERAGE('D.8 BWS'!$AG$22:$AG$26),\"-\")","v":"-"},{"$f":"IFERROR('D.8 BWS'!$AG$37,\"-\")","v":0.42057521603313047},{"$f":"IFERROR('D.8 BWS'!$AG$38,\"-\")","v":0.43094842920168691},"-","-",2.4664347239470472]
[null,{"$f":"Codierung!$I$12","v":"Inland und Import"},{"$f":"Codierung!$I$2","v":"Einstandspreis "},{"$f":"IFERROR(AVERAGE('D.8 BWS'!$AH$17:$AH$21),\"-\")","v":"-"},{"$f":"IFERROR(AVERAGE('D.8 BWS'!$AH$22:$AH$26),\"-\")","v":"-"},{"$f":"IFERROR('D.8 BWS'!$AH$37,\"-\")","v":0.21328418692686602},{"$f":"IFERROR('D.8 BWS'!$AH$38,\"-\")","v":0.22317433465901135},"-","-",4.6370750099427722]
[null,null,{"$f":"Codierung!$I$3","v":"Nettoeinnahmen "},{"$f":"IFERROR(AVERAGE('D.8 BWS'!$AI$17:$AI$21),\"-\")","v":"-"},{"$f":"IFERROR(AVERAGE('D.8 BWS'!$AI$22:$AI$26),\"-\")","v":"-"},{"$f":"IFERROR('D.8 BWS'!$AI$37,\"-\")","v":0.42442533529311333},{"$f":"IFERROR('D.8 BWS'!$AI$38,\"-\")","v":0.42504185570910519},"-","-",0.14526004098367143]
[null,null,{"$f":"Codierung!$I$4","v":"Bruttowertschöpfung"},{"$f":"IFERROR(AVERAGE('D.8 BWS'!$AJ$17:$AJ$21),\"-\")","v":"-"},{"$f":"IFERROR(AVERAGE('D.8 BWS'!$AJ$22:$AJ$26),\"-\")","v":"-"},{"$f":"IFERROR('D.8 BWS'!$AJ$37,\"-\")","v":0.21114114836624728},{"$f":"IFERROR('D.8 BWS'!$AJ$38,\"-\")","v":0.20186752105009387},"-","-",-4.3921459118273338]
[null,null,{"$f":"Codierung!$I$6","v":"Produzentenpreisanteil am Gastronomenfranken"},{"$f":"IFERROR(AVERAGE('D.8 BWS'!$AK$17:$AK$21),\"-\")","v":"-"},{"$f":"IFERROR(AVERAGE('D.8 BWS'!$AK$22:$AK$26),\"-\")","v":"-"},{"$f":"IFERROR('D.8 BWS'!$AK$37,\"-\")","v":0.50243442439415931},{"$f":"IFERROR('D.8 BWS'!$AK$38,\"-\")","v":0.52599481857795216},"-","-",4.6892475992667553]
[null,{"$f":"Codierung!$I$13","v":"Konsumeier Import"},{"$f":"Codierung!$I$2","v":"Einstandspreis "},{"$f":"IFERROR(AVERAGE('D.8 BWS'!$AL$17:$AL$21),\"-\")","v":"-"},{"$f":"IFERROR(AVERAGE('D.8 BWS'!$AL$22:$AL$26),\"-\")","v":"-"},{"$f":"IFERROR('D.8 BWS'!$AL$37,\"-\")","v":0.1360805496942748},{"$f":"IFERROR('D.8 BWS'!$AL$38,\"-\")","v":0.14746737450977285},"-","-",8.3677093023802769]
[null,null,{"$f":"Codierung!$I$3","v":"Nettoeinnahmen "},{"$f":"IFERROR(AVERAGE('D.8 BWS'!$AM$17:$AM$21),\"-\")","v":"-"},{"$f":"IFERROR(AVERAGE('D.8 BWS'!$AM$22:$AM$26),\"-\")","v":"-"},{"$f":"IFERROR('D.8 BWS'!$AM$37,\"-\")","v":0.33219471655719424},{"$f":"IFERROR('D.8 BWS'!$AM$38,\"-\")","v":0.34585749120332648},"-","-",4.1128813810558951]
[null,null,{"$f":"Codierung!$I$4","v":"Bruttowertschöpfung"},{"$f":"IFERROR(AVERAGE('D.8 BWS'!$AN$17:$AN$21),\"-\")","v":"-"},{"$f":"IFERROR(AVERAGE('D.8 BWS'!$AN$22:$AN$26),\"-\")","v":"-"},{"$f":"IFERROR('D.8 BWS'!$AN$37,\"-\")","v":0.19611416686291949},{"$f":"IFERROR('D.8 BWS'!$AN$38,\"-\")","v":0.19839011669355364},"-","-",1.160522907162028]
[null,null,{"$f":"Codierung!$I$6","v":"Produzentenpreisanteil am Gastronomenfranken"},{"$f":"IFERROR(AVERAGE('D.8 BWS'!$AO$17:$AO$21),\"-\")","v":"-"},{"$f":"IFERROR(AVERAGE('D.8 BWS'!$AO$22:$AO$26),\"-\")","v":"-"},{"$f":"IFERROR('D.8 BWS'!$AO$37,\"-\")","v":0.40969279495715311},{"$f":"IFERROR('D.8 BWS'!$AO$38,\"-\")","v":0.4282092690122164},"-","-",4.5195996324513832]

{"sheet":"9. Int.","index":12,"n_rows":48,"n_cols":9,"rows_kept":48,"cut":false,"hidden":false,"merged":[[42,2,47,2],[15,0,32,0],[30,2,32,2],[27,2,29,2],[24,2,26,2],[21,2,23,2],[15,2,17,2],[24,1,32,1],[15,1,23,1],[18,2,20,2],[34,0,40,0],[37,1,40,1],[34,1,36,1],[42,0,47,0]]}
[null,null,null,null,{"$f":"Codierung!I184","v":"Eidgenössisches Departement für  Wirtschaft, Bildung und Forschung WBF"}]
[null,null,null,null,{"$f":"Codierung!I185","v":"Bundesamt für Landwirtschaft BLW"}]
[null,null,null,null,{"$f":"Codierung!I186","v":"Fachbereich Marktanalysen"}]
[]
[null,null,null,null,{"$f":"Codierung!I242","v":"Anmerkungen:"}]
[{"$f":"Codierung!I179","v":"Internationale Marktzahlen"},null,null,null,"(2)",{"$f":"Codierung!I254","v":"Nur Kleinmengen (Absatz von 1 bis 15 Kartons)"}]
[{"$f":"Codierung!$I$218","v":"in Euro / Ei"},null,null,null,"(3)",{"$f":"Codierung!I250","v":"Produzentenpreise für Eier, welche an Feinkostläden und den Fachhandel geliefert werden (darum nicht repräsentativ für Gesamtmarkt, wo durchschnittlich tiefere Preise ausbezahlt werden)"}]
[{"$f":"Codierung!$I$223","v":"in Stück / Kopf"},null,null,null,null,{"$f":"Codierung!I256","v":"Aufbereitete Grafiken unterhalb der Datentabellen"}]
[{"$f":"Codierung!$I$212","v":"Quellen Preise: AMA Österreich; GfK Austria MEG Deutschland; AMI Deutschland"}]
[{"$f":"Codierung!$I$214","v":"Quellen Pro-Kopf-Verbrauch: BLE; Statistik Austria; EU; USDA; Agri-Food & Veterinary Authority of Singapore"}]
[{"$f":"Codierung!$I$154","v":"Zurück zum Inhaltsverzeichnis"}]
[{"$f":"Codierung!$I$253","v":"Informationen zur Methodik"},null,null,null,{"$f":"Codierung!$I$252&'D.9 Int.'!$A$18&\"-\"&'D.9 Int.'!$A$22","v":"Ø 2006-2010"},{"$f":"'D.9 Int.'!$A$33","v":2021},{"$f":"'D.9 Int.'!$A$34","v":2022},{"$f":"Codierung!$J$237&\" \"&E12","v":"%-∆ Ø 2006-2010"},{"$f":"Codierung!$I$233","v":"%-∆ Vorjahr"}]
[]
[{"$f":"Codierung!$I$120","v":"Wechselkurs CHF/Euro"},null,null,null,{"$f":"IFERROR(AVERAGE('D.9 Int.'!$B16:$C$22),\"-\")","v":1.0552657763572393},{"$f":"IFERROR('D.9 Int.'!$B$33,\"-\")","v":1.081},{"$f":"IFERROR('D.9 Int.'!$B$34,\"-\")","v":1.0047999999999999},{"$f":"IFERROR((G14-E14)/E14*100,\"-\")","v":-4.7822811549377091},{"$f":"IFERROR((G14-F14)/F14*100,\"-\")","v":-7.0490286771507913}]
[]
[{"$f":"Codierung!$I$104","v":"Produzentenpreise International"},{"$f":"Codierung!$I$188","v":"Deutschland"},{"$f":"Codierung!$I$10","v":"Bodenhaltung"},"L: 63 - 73 g",{"$f":"IFERROR(AVERAGE('D.9 Int.'!$C18:$C$22),\"-\")","v":8.5480050505050489E-2},{"$f":"IFERROR('D.9 Int.'!$C$33,\"-\")","v":7.6141666666666663E-2},{"$f":"IFERROR('D.9 Int.'!$C$34,\"-\")","v":0.12063333333333333},{"$f":"IFERROR((G16-E16)/E16*100,\"-\")","v":41.124546160868078},{"$f":"IFERROR((G16-F16)/F16*100,\"-\")","v":58.43274597789209}]
[null,null,null,"M: 53 - 63 g",{"$f":"IFERROR(AVERAGE('D.9 Int.'!$D18:$D$22),\"-\")","v":7.7551515151515163E-2},{"$f":"IFERROR('D.9 Int.'!$D$33,\"-\")","v":6.695000000000001E-2},{"$f":"IFERROR('D.9 Int.'!$D$34,\"-\")","v":0.108975},40.51949828071271,62.770724421209835]
[null,null,null,"S: < 53 g",{"$f":"IFERROR(AVERAGE('D.9 Int.'!$E18:$E$22),\"-\")","v":"-"},{"$f":"IFERROR('D.9 Int.'!$E$33,\"-\")","v":5.333333333333333E-2},{"$f":"IFERROR('D.9 Int.'!$E$34,\"-\")","v":8.9141666666666661E-2},"-",67.140625]
[null,null,{"$f":"Codierung!$I$77","v":"Freilandhaltung (2)"},"L: 63 - 73 g",{"$f":"IFERROR(AVERAGE('D.9 Int.'!$E19:$E$22),\"-\")","v":"-"},{"$f":"IFERROR('D.9 Int.'!$F$33,\"-\")","v":0.17871666666666666},{"$f":"IFERROR('D.9 Int.'!$F$34,\"-\")","v":0.21506666666666663},"-",{"$f":"IFERROR((G19-F19)/F19*100,\"-\")","v":20.339457241443608}]
[null,null,null,"M: 53 - 63 g",{"$f":"IFERROR(AVERAGE('D.9 Int.'!$E20:$E$22),\"-\")","v":"-"},{"$f":"IFERROR('D.9 Int.'!$G$33,\"-\")","v":0.16172500000000004},{"$f":"IFERROR('D.9 Int.'!$G$34,\"-\")","v":0.19900833333333334},"-",23.05353738341833]
[null,null,null,"S: < 53 g",{"$f":"IFERROR(AVERAGE('D.9 Int.'!$E21:$H$22),\"-\")","v":"-"},{"$f":"IFERROR('D.9 Int.'!$H$33,\"-\")","v":0.11937499999999998},{"$f":"IFERROR('D.9 Int.'!$H$34,\"-\")","v":0.14920833333333333},"-",24.991273996509616]
[null,null,{"$f":"Codierung!$I$76","v":"Bio (3)"},"L: 63 - 73 g",{"$f":"IFERROR(AVERAGE('D.9 Int.'!$I18:$I$22),\"-\")","v":"-"},{"$f":"IFERROR('D.9 Int.'!$I$33,\"-\")","v":0.26200000000000001},{"$f":"IFERROR('D.9 Int.'!$I$34,\"-\")","v":0.20582500000000001},"-",-21.440839694656489]
[null,null,null,"M: 53 - 63 g",{"$f":"IFERROR(AVERAGE('D.9 Int.'!$J18:$J$22),\"-\")","v":"-"},{"$f":"IFERROR('D.9 Int.'!$J$33,\"-\")","v":0.25886666666666669},{"$f":"IFERROR('D.9 Int.'!$J$34,\"-\")","v":0.20220833333333332},"-",-21.887071851661098]
[null,null,null,"S: < 53 g",{"$f":"IFERROR(AVERAGE('D.9 Int.'!$K18:$K$22),\"-\")","v":"-"},{"$f":"IFERROR('D.9 Int.'!$K$33,\"-\")","v":0.20013333333333336},{"$f":"IFERROR('D.9 Int.'!$K$34,\"-\")","v":0.16621666666666665},"-",-16.947035309793488]
[null,{"$f":"Codierung!$I$190","v":"Österreich"},{"$f":"Codierung!$I$9","v":"Bio"},"L: 63 - 73 g",{"$f":"IFERROR(AVERAGE('D.9 Int.'!$L18:$L$22),\"-\")","v":0.19812828282828285},{"$f":"IFERROR('D.9 Int.'!$L$33,\"-\")","v":0.28243333333333337},{"$f":"IFERROR('D.9 Int.'!$L$34,\"-\")","v":0.324075},63.568267676793411,{"$f":"IFERROR((G25-F25)/F25*100,\"-\")","v":14.743892363979686}]
[null,null,null,"M: 53 - 63 g",{"$f":"IFERROR(AVERAGE('D.9 Int.'!$M18:$M$22),\"-\")","v":0.18628611111111107},{"$f":"IFERROR('D.9 Int.'!$M$33,\"-\")","v":0.27041666666666669},{"$f":"IFERROR('D.9 Int.'!$M$34,\"-\")","v":0.30988333333333329},66.348060778670813,14.59476117103233]
[null,null,null,"S: < 53 g",{"$f":"IFERROR(AVERAGE('D.9 Int.'!$N18:$N$22),\"-\")","v":0.20111439393939393},"-","-","-","-"]
[null,null,{"$f":"Codierung!$I$10","v":"Bodenhaltung"},"L: 63 - 73 g",{"$f":"IFERROR(AVERAGE('D.9 Int.'!$O18:$O$22),\"-\")","v":0.10207666666666668},{"$f":"IFERROR('D.9 Int.'!$O$33,\"-\")","v":0.12724166666666667},{"$f":"IFERROR('D.9 Int.'!$O$34,\"-\")","v":0.16635833333333336},62.973908500146955,30.742026327853839]
[null,null,null,"M: 53 - 63 g",{"$f":"IFERROR(AVERAGE('D.9 Int.'!$P18:$P$22),\"-\")","v":9.0391666666666676E-2},{"$f":"IFERROR('D.9 Int.'!$P$33,\"-\")","v":0.11244999999999999},{"$f":"IFERROR('D.9 Int.'!$P$34,\"-\")","v":0.15109166666666665},67.152207983774275,34.363420779605747]
[null,null,null,"S: < 53 g",{"$f":"IFERROR(AVERAGE('D.9 Int.'!$Q18:$Q$22),\"-\")","v":0.11520166666666667},{"$f":"IFERROR('D.9 Int.'!$Q$33,\"-\")","v":"-"},{"$f":"IFERROR('D.9 Int.'!$Q$34,\"-\")","v":"-"},"-","-"]
[null,null,{"$f":"Codierung!$I$11","v":"Freilandhaltung"},"L: 63 - 73 g",{"$f":"IFERROR(AVERAGE('D.9 Int.'!$R18:$R$22),\"-\")","v":0.1185725},{"$f":"IFERROR('D.9 Int.'!$R$33,\"-\")","v":0.14514166666666667},{"$f":"IFERROR('D.9 Int.'!$R$34,\"-\")","v":0.18720833333333334},57.885119511972292,28.983177355457311]
[null,null,null,"M: 53 - 63 g",{"$f":"IFERROR(AVERAGE('D.9 Int.'!$S18:$S$22),\"-\")","v":0.13445874999999999},{"$f":"IFERROR('D.9 Int.'!$S$33,\"-\")","v":0.19597499999999998},{"$f":"IFERROR('D.9 Int.'!$S$34,\"-\")","v":0.25839166666666663},92.171700738454476,31.84930050601692]
[null,null,null,"S: < 53 g",{"$f":"IFERROR(AVERAGE('D.9 Int.'!$T18:$T$22),\"-\")","v":0},{"$f":"IFERROR('D.9 Int.'!$T$33,\"-\")","v":"-"},{"$f":"IFERROR('D.9 Int.'!$T$34,\"-\")","v":"-"},"-","-"]
[]
[{"$f":"Codierung!$I$103","v":"Konsumentenpreise International"},{"$f":"Codierung!$I$188","v":"Deutschland"},{"$f":"Codierung!$I$9","v":"Bio"},{"$f":"Codierung!$I$119","v":"M, 10er Packung"},{"$f":"IFERROR(AVERAGE('D.9 Int.'!$U18:$U$22),\"-\")","v":0.28224999999999995},{"$f":"IFERROR('D.9 Int.'!$U$33,\"-\")","v":0.34208333333333341},{"$f":"IFERROR('D.9 Int.'!$U$34,\"-\")","v":0.36116666666666664},{"$f":"IFERROR((G35-E35)/E35*100,\"-\")","v":27.959846471803967},5.5785627283799935]
[null,null,{"$f":"Codierung!$I$10","v":"Bodenhaltung"},{"$f":"Codierung!$I$119","v":"M, 10er Packung"},{"$f":"IFERROR(AVERAGE('D.9 Int.'!$V18:$V$22),\"-\")","v":0.13794444444444445},{"$f":"IFERROR('D.9 Int.'!$V$33,\"-\")","v":0.15575},{"$f":"IFERROR('D.9 Int.'!$V$34,\"-\")","v":0.1946666666666666},41.119613370922217,24.986623863028314]
[null,null,{"$f":"Codierung!$I$11","v":"Freilandhaltung"},{"$f":"Codierung!$I$119","v":"M, 10er Packung"},{"$f":"IFERROR(AVERAGE('D.9 Int.'!$W18:$W$22),\"-\")","v":0.17113888888888887},{"$f":"IFERROR('D.9 Int.'!$W$33,\"-\")","v":0.21600000000000003},{"$f":"IFERROR('D.9 Int.'!$W$34,\"-\")","v":0.24341666666666667},42.233403668235695,12.692901234567891]
[null,{"$f":"Codierung!$I$190","v":"Österreich"},{"$f":"Codierung!$I$9","v":"Bio"},{"$f":"Codierung!$I$117","v":"M, 6er und 10er Packung"},{"$f":"IFERROR(AVERAGE('D.9 Int.'!$X18:$X$22),\"-\")","v":0.38738083282967412},"-","-","-","-"]
[null,null,{"$f":"Codierung!$I$9","v":"Bio"},{"$f":"Codierung!$I$118","v":"M, 4er und 6er Packung"},{"$f":"IFERROR(AVERAGE('D.9 Int.'!$Y18:$Y$22),\"-\")","v":0.40264613412827255},{"$f":"IFERROR('D.9 Int.'!$Y$33,\"-\")","v":0.5176694580741088},{"$f":"IFERROR('D.9 Int.'!$Y$34,\"-\")","v":0.55805372886811888},38.596569435915043,7.8011692913567101]
[null,null,{"$f":"Codierung!$I$10","v":"Bodenhaltung"},{"$f":"Codierung!$I$117","v":"M, 6er und 10er Packung"},{"$f":"IFERROR(AVERAGE('D.9 Int.'!$Z18:$Z$22),\"-\")","v":0.19791886349166435},{"$f":"IFERROR('D.9 Int.'!$Z$33,\"-\")","v":0.21072768449354171},{"$f":"IFERROR('D.9 Int.'!$Z$34,\"-\")","v":0.26380078049034278},33.287335949891983,25.185630509040983]
[null,null,{"$f":"Codierung!$I$11","v":"Freilandhaltung"},{"$f":"Codierung!$I$117","v":"M, 6er und 10er Packung"},{"$f":"IFERROR(AVERAGE('D.9 Int.'!$AA18:$AA$22),\"-\")","v":0.33670263138383627},{"$f":"IFERROR('D.9 Int.'!$AA$33,\"-\")","v":0.33212013096203802},{"$f":"IFERROR('D.9 Int.'!$AA$34,\"-\")","v":0.34648314374457995},2.9047923743708521,4.3246438392449171]
[]
[{"$f":"Codierung!$I$105","v":"Pro-Kopf-Verbrauch International"},{"$f":"Codierung!$I$187","v":"Schweiz"},{"$f":"Codierung!$I$28","v":"Schaleneier"},{"$f":"Codierung!$I$223","v":"in Stück / Kopf"},{"$f":"'1. Prod + AH + Verbrauch'!F44","v":174.96521314975229},{"$f":"'1. Prod + AH + Verbrauch'!G44","v":195.16464580369126},{"$f":"IF('1. Prod + AH + Verbrauch'!H44=0,\"-\",'1. Prod + AH + Verbrauch'!H44)","v":185.63658793872042},{"$f":"IFERROR((G43-E43)/E43*100,\"-\")","v":6.0991408502640665},{"$f":"IFERROR((G43-F43)/F43*100,\"-\")","v":-4.8820614131899411}]
[null,{"$f":"Codierung!$I$188","v":"Deutschland"},null,{"$f":"Codierung!$I$223","v":"in Stück / Kopf"},{"$f":"AVERAGE('D.9 Int.'!$AB$18:$AB$22)","v":210},{"$f":"'D.9 Int.'!$AB$33","v":237.50800769971121},{"$f":"IF('D.9 Int.'!$AB$34=0,\"-\",'D.9 Int.'!$AB$34)","v":"-"},"-",{"$f":"IFERROR((G44-F44)/F44*100,\"-\")","v":"-"}]
[null,{"$f":"Codierung!$I$190","v":"Österreich"},null,{"$f":"Codierung!$I$223","v":"in Stück / Kopf"},{"$f":"AVERAGE('D.9 Int.'!$AC$18:$AC$22)","v":234.89027000525954},{"$f":"'D.9 Int.'!$AC$33","v":233},{"$f":"IF('D.9 Int.'!$AC$34=0,\"-\",'D.9 Int.'!$AC$34)","v":"-"},"-","-"]
[null,{"$f":"Codierung!$I$195","v":"EU-15"},null,{"$f":"Codierung!$I$223","v":"in Stück / Kopf"},{"$f":"AVERAGE('D.9 Int.'!$AD$18:$AD$22)","v":223.51556844082384},{"$f":"'D.9 Int.'!$AD$33","v":229.291042762128},{"$f":"IF('D.9 Int.'!$AD$34=0,\"-\",'D.9 Int.'!$AD$34)","v":"-"},"-",{"$f":"IFERROR((G46-F46)/F46*100,\"-\")","v":"-"}]
[null,{"$f":"Codierung!$I$196","v":"USA"},null,{"$f":"Codierung!$I$223","v":"in Stück / Kopf"},{"$f":"AVERAGE('D.9 Int.'!$AE$18:$AE$22)","v":246.91014955155893},{"$f":"'D.9 Int.'!$AE$33","v":280.49380000000002},{"$f":"IF('D.9 Int.'!$AE$34=0,\"-\",'D.9 Int.'!$AE$34)","v":"-"},"-","-"]
[null,{"$f":"Codierung!$I$197","v":"Singapur"},null,{"$f":"Codierung!$I$223","v":"in Stück / Kopf"},{"$f":"AVERAGE('D.9 Int.'!$AF$18:$AF$22)","v":299.60000000000002},{"$f":"'D.9 Int.'!$AF$33","v":390},{"$f":"IF('D.9 Int.'!$AF$34=0,\"-\",'D.9 Int.'!$AF$34)","v":"-"},"-","-"]

{"sheet":"Dashboard","index":13,"n_rows":0,"n_cols":0,"rows_kept":0,"cut":false,"hidden":false,"merged":[]}

{"sheet":"D.1 Prod + AH + Verbrauch","index":14,"n_rows":50,"n_cols":32,"rows_kept":50,"cut":false,"hidden":false,"merged":[]}
[null,null,null,null,null,null,null,{"$f":"Codierung!I184","v":"Eidgenössisches Departement für  Wirtschaft, Bildung und Forschung WBF"}]
[null,null,null,null,null,null,null,{"$f":"Codierung!I185","v":"Bundesamt für Landwirtschaft BLW"}]
[null,null,null,null,null,null,null,{"$f":"Codierung!I186","v":"Fachbereich Marktanalysen"}]
[]
[null,null,null,null,null,{"$f":"Codierung!I242","v":"Anmerkungen:"}]
[{"$f":"Codierung!$I$170","v":"Produktion, Aussenhandel und Verbrauch"},null,null,null,null,"(1)",{"$f":"Codierung!$I$243","v":"Schätzung PaKo (paritätische Kommission Eier)"}]
[{"$f":"Codierung!$I$222","v":"in Mio. Stück"},null,null,null,null,"(2)",{"$f":"Codierung!$I$244","v":"Schätzung Agristat (SBV)"}]
[{"$f":"Codierung!$I$224","v":"in %"},null,null,null,null,"(3)",{"$f":"Codierung!$I$245","v":"Bis 2015: Berechnung/Schätzung Aviforum; ab 2016: Erhebung BLW"}]
[{"$f":"Codierung!$I$223","v":"in Stück / Kopf"},null,null,null,null,"(4)",{"$f":"Codierung!$I$246","v":"Verbrauch und Importe nun bereinigt (ohne Veredelungsverkehr)"}]
[{"$f":"Codierung!I210","v":"Quellen: BLW, Fachbereich Marktanalysen; SBV; EZV; Aviforum"},null,null,null,null,"(5)",{"$f":"Codierung!$I$251","v":"Umrechnungsfaktoren: Eiprodukte getrocknet 80 Eier / kg; Eiprodukte flüssig 20.58 Eier / kg; Schaleneier 16.6 Eier / kg"}]
[{"$f":"Codierung!I215","v":"Publikationsrecht: Weiterverarbeitung und Publikation unter Quellenangabe gestattet."},null,null,null,null,"(6)",{"$f":"Codierung!$I$260","v":"2017: Erweiterung Erhebung Kükenstatistik aufgrund angepasster Marktverhältnisse (Erhöhung Inlandproduktion um ca. 17 Mio. Eier bzw. ca. + 2 Eier / Kopf)"}]
[null,null,null,null,null,"(7)",{"$f":"Codierung!$I$265","v":"Erhebung Schweizer Vearbeitungseiermengen seit 2020 (rückwirkend bis 2016) direkt bei den Betrieben und Verarbeitungsunternehmen"}]
[{"$f":"Codierung!$I$154","v":"Zurück zum Inhaltsverzeichnis"}]
[{"$f":"Codierung!$I$253","v":"Informationen zur Methodik"}]
[null,{"$f":"Codierung!$I$27","v":"Bevölkerung"},{"$f":"Codierung!$I$28","v":"Schaleneier"},null,null,null,{"$f":"Codierung!$I$29","v":"Eiprodukte (5)"},null,null,null,{"$f":"Codierung!$I$30","v":"Verbrauch Inland"},null,null,null,null,null,null,null,null,null,null,null,null,{"$f":"Codierung!$I$31","v":"Pro-Kopf-Verbrauch"}]
[null,null,{"$f":"Codierung!$I$32","v":"Inland"},{"$f":"Codierung!$I$33","v":"Import (abzügl. Exporte und Rückwaren)"},null,null,{"$f":"Codierung!$I$32","v":"Inland"},{"$f":"Codierung!$I$33","v":"Import (abzügl. Exporte und Rückwaren)"},null,null,{"$f":"Codierung!$I$34","v":"Schaleneier (exkl. Verarbeitungseier)"},null,null,null,null,{"$f":"Codierung!$I$35","v":"Eiprodukte (inkl. Verarbeitungseier)"},null,null,null,null,{"$f":"Codierung!$I$36","v":"Total"},null,null,{"$f":"Codierung!$I$36","v":"Total"},null,null,{"$f":"Codierung!$I$28","v":"Schaleneier"},null,null,{"$f":"Codierung!$I$37","v":"Eiprodukte"}]
[null,{"$f":"Codierung!$I$38","v":"Ø-Bevölkerung inkl. Tourismus und Grenzgänger (2)"},{"$f":"Codierung!$I$39","v":"Produktion Total"},{"$f":"Codierung!$I$40","v":"Konsumeier"},{"$f":"Codierung!$I$41","v":"Verarbeitungseier"},{"$f":"Codierung!$I$36","v":"Total"},{"$f":"Codierung!$I$42","v":"Verarbeitung CH-Eier zu Eiprodukten (3)"},{"$f":"Codierung!$I$43","v":"Eiprodukte flüssig"},{"$f":"Codierung!$I$44","v":"Eiprodukte getrocknet"},{"$f":"Codierung!$I$41","v":"Verarbeitungseier"},{"$f":"Codierung!$I$32","v":"Inland"},{"$f":"Codierung!$I$45","v":"Import"},{"$f":"Codierung!$I$36","v":"Total"},{"$f":"Codierung!$I$46","v":"Anteil Inland"},{"$f":"Codierung!$I$47","v":"Anteil Import"},{"$f":"Codierung!$I$48","v":"Inland (3)"},{"$f":"Codierung!$I$45","v":"Import"},{"$f":"Codierung!$I$36","v":"Total"},{"$f":"Codierung!$I$46","v":"Anteil Inland"},{"$f":"Codierung!$I$47","v":"Anteil Import"},null,{"$f":"Codierung!$I$46","v":"Anteil Inland"},{"$f":"Codierung!$I$47","v":"Anteil Import"},{"$f":"Codierung!$I$32","v":"Inland"},{"$f":"Codierung!$I$45","v":"Import"},{"$f":"Codierung!$I$36","v":"Total"},{"$f":"Codierung!$I$32","v":"Inland"},{"$f":"Codierung!$I$45","v":"Import"},{"$f":"Codierung!$I$36","v":"Total"},{"$f":"Codierung!$I$32","v":"Inland"},{"$f":"Codierung!$I$45","v":"Import"},{"$f":"Codierung!$I$36","v":"Total"}]
[null,{"$f":"Codierung!$I$225","v":"in Anz. Personen"},{"$f":"Codierung!$I$222","v":"in Mio. Stück"},"In Mio. Stück",{"$f":"Codierung!$I$222","v":"in Mio. Stück"},{"$f":"Codierung!$I$222","v":"in Mio. Stück"},{"$f":"Codierung!$I$222","v":"in Mio. Stück"},{"$f":"Codierung!$I$222","v":"in Mio. Stück"},{"$f":"Codierung!$I$222","v":"in Mio. Stück"},{"$f":"Codierung!$I$222","v":"in Mio. Stück"},{"$f":"Codierung!$I$222","v":"in Mio. Stück"},{"$f":"Codierung!$I$222","v":"in Mio. Stück"},{"$f":"Codierung!$I$222","v":"in Mio. Stück"},{"$f":"Codierung!$I$224","v":"in %"},{"$f":"Codierung!$I$224","v":"in %"},{"$f":"Codierung!$I$222","v":"in Mio. Stück"},{"$f":"Codierung!$I$222","v":"in Mio. Stück"},{"$f":"Codierung!$I$222","v":"in Mio. Stück"},{"$f":"Codierung!$I$224","v":"in %"},{"$f":"Codierung!$I$224","v":"in %"},{"$f":"Codierung!$I$222","v":"in Mio. Stück"},{"$f":"Codierung!$I$224","v":"in %"},{"$f":"Codierung!$I$224","v":"in %"},{"$f":"Codierung!$I$223","v":"in Stück / Kopf"},{"$f":"Codierung!$I$223","v":"in Stück / Kopf"},{"$f":"Codierung!$I$223","v":"in Stück / Kopf"},{"$f":"Codierung!$I$223","v":"in Stück / Kopf"},{"$f":"Codierung!$I$223","v":"in Stück / Kopf"},{"$f":"Codierung!$I$223","v":"in Stück / Kopf"},{"$f":"Codierung!$I$223","v":"in Stück / Kopf"},{"$f":"Codierung!$I$223","v":"in Stück / Kopf"},{"$f":"Codierung!$I$223","v":"in Stück / Kopf"}]
[1975,6487000,719,364,null,364,null,188,null,null,719,364,1083,null,null,null,188,188,null,null,1271,null,null,110.83705873285031,85.093263449976874,195.93032218282718,110.83705873285031,56.112224448897798,166.94928318174811,null,28.981039001079083,28.981039001079083]
[1980,6329000,749,422.31900000000002,null,422.31900000000002,null,203.84399999999999,null,null,749,422.31900000000002,1171.319,null,null,null,203.84399999999999,203.84399999999999,null,null,1375.163,null,null,118.34413019434349,98.93553483962711,217.27966503397062,118.34413019434349,66.727603096855745,185.07173329119922,null,32.207931742771372,32.207931742771372]
[1985,6624000,761,495,null,495,null,201,null,null,761,495,1256,null,null,null,201,201,null,null,1457,null,null,114.88526570048309,105.07246376811594,219.95772946859904,114.88526570048309,74.728260869565219,189.61352657004829,null,30.344202898550726,30.344202898550726]
[1990,6850000,637,512,null,512,null,219,null,null,637,512,1149,null,null,null,219,219,null,null,1368,null,null,92.992700729927009,106.71532846715328,199.70802919708029,92.992700729927009,74.744525547445249,167.73722627737226,null,31.970802919708028,31.970802919708028]
[1995,7161000,591.85,260.99799999999999,151.21899999999999,412.21699999999998,28.009,201.57599999999999,73.605000000000004,151.21899999999999,563.84100000000001,260.99799999999999,824.83899999999994,0.68357703745821918,0.31642296254178087,28.009,426.4,454.40899999999999,6.163830381880641E-2,0.93836169618119358,1279.248,0.46265462209047814,0.53734537790952175,82.649071358748785,95.991900572545717,178.6409719312945,78.7377461248429,36.447144253595866,115.18489037843877,3.9113252339058793,59.544756318949865,63.456081552855743]
[1996,7160000,653.87,285.09699999999998,156.55600000000001,441.65300000000002,26.367999999999999,183.70800000000003,50.510999999999996,156.55600000000001,627.50199999999995,285.09699999999998,912.59899999999993,0.68759882489461421,0.31240117510538584,26.367999999999999,390.77500000000003,417.14300000000003,6.3210937256528335E-2,0.93678906274347173,1329.742,0.49172696658449533,0.50827303341550478,91.322625698324018,94.395530726256993,185.71815642458103,87.639944134078206,39.818016759776533,127.45796089385473,3.6826815642458102,54.577513966480453,58.260195530726264]
[1997,7160000,663.03,249.59299999999999,127.285,376.87799999999999,25,218.488,57.207999999999998,127.285,638.03,249.59299999999999,887.62299999999993,0.71880742161931366,0.2811925783806864,25,402.98099999999999,427.98099999999999,5.8413808089611455E-2,0.9415861919103885,1315.6039999999998,0.5039738401525079,0.49602615984749215,92.601955307262571,91.141620111731839,183.7435754189944,89.110335195530723,34.859357541899442,123.96969273743017,3.4916201117318435,56.282262569832405,59.773882681564245]
[1998,7230000,691.39,229.36599999999999,145.80000000000001,375.166,25,226.429,81.486000000000004,145.80000000000001,666.39,229.36599999999999,895.75599999999997,0.74394143047883576,0.25605856952116424,25,453.71500000000003,478.71500000000003,5.2223139028440717E-2,0.94777686097155933,1374.471,0.50302261742881438,0.49697738257118557,95.627939142461955,94.478699861687417,190.10663900414937,92.170124481327804,31.72420470262794,123.89432918395575,3.4578146611341634,62.754495159059481,66.212309820193639]
[1999,7290000,680,230.19399999999999,156.33099999999999,386.52499999999998,25,229.21299999999999,128.62100000000001,156.33099999999999,655,230.19399999999999,885.19399999999996,0.73995079044819556,0.26004920955180444,25,514.16499999999996,539.16499999999996,4.6367994955162153E-2,0.9536320050448378,1424.3589999999999,0.47740773217987881,0.52259226782012114,93.27846364883402,102.10685871056241,195.38532235939641,89.849108367626883,31.576680384087791,121.42578875171468,3.4293552812071328,70.530178326474612,73.959533607681749]
[2000,7350000,685,219.06299999999999,172.33699999999999,391.4,25,224.494,61.606999999999999,172.33699999999999,660,219.06299999999999,879.06299999999999,0.75079943075752253,0.24920056924247749,25,458.43799999999999,483.43799999999999,5.1712939404846121E-2,0.94828706059515389,1362.501,0.50275192458574347,0.49724807541425659,93.197278911564624,92.177006802721081,185.37428571428569,89.795918367346943,29.804489795918368,119.60040816326531,3.4013605442176869,62.372517006802724,65.773877551020405]
[2001,7400000,680.00000000000102,233.19699999999997,188.357,421.55399999999997,15,232.297,61.244999999999997,188.357,665.00000000000102,233.19699999999997,898.19700000000103,0.7403721009978883,0.2596278990021117,15,481.899,496.899,3.0187221145544667E-2,0.96981277885445538,1395.0960000000009,0.4874216541370634,0.51257834586293671,91.89189189189203,96.634594594594603,188.52648648648665,89.864864864865012,31.513108108108103,121.37797297297311,2.0270270270270272,65.121486486486489,67.148513513513521]
[2002,7460000,703.00000000000102,224.53267899999992,191.29353619999998,415.82621519999987,26,185.75186952000013,56.153680000000001,191.29353619999998,677.00000000000102,224.53267899999992,901.53267900000094,0.75094338316270881,0.24905661683729124,26,433.19908572000008,459.19908572000008,5.6620321791872395E-2,0.94337967820812763,1360.7317647200011,0.51663378354708867,0.48336621645291128,94.235924932976005,88.167796879356573,182.40372181233258,90.750670241287011,30.098214343163527,120.84888458445053,3.4852546916890081,58.069582536193039,61.554837227882047]
[2003,7520000,690.55999999999847,222.50067300000001,180.93530220000002,403.43597520000003,24,165.02212944000004,52.355759999999997,180.93530220000002,666.55999999999847,222.50067300000001,889.06067299999847,0.74973510834844859,0.25026489165155141,24,398.31319164000007,422.31319164000007,5.6829861048855762E-2,0.94317013895114421,1311.3738646399986,0.52659277313687547,0.47340722686312442,91.829787234042357,82.555035191489367,174.38482242553172,88.638297872340218,29.587855452127659,118.22615332446787,3.1914893617021276,52.967179739361711,56.158669101063836]
[2004,7560000,651.7109999999999,230.87665120000014,211.33986219999997,442.21651340000011,20,140.71177806,52.218400000000003,211.33986219999997,631.7109999999999,230.87665120000014,862.58765119999998,0.73234412656057268,0.26765587343942737,20,404.27004025999997,424.27004025999997,4.7139788583100653E-2,0.95286021141689936,1286.8576914599998,0.50643595195099111,0.49356404804900894,86.205158730158715,84.014112626984144,170.21927135714287,83.559656084656069,30.539239576719595,114.09889566137566,2.6455026455026456,53.474873050264549,56.120375695767194]
[2005,7600000,656.92500000000121,232.97701599999996,218.9939396,451.97095559999997,30,128.63331432000001,66.064800000000005,218.9939396,626.92500000000121,232.97701599999996,859.90201600000114,0.72906562414664744,0.27093437585335262,30,413.69205392000003,443.69205392000003,6.7614463083012874E-2,0.93238553691698711,1303.5940699200012,0.50393371307704349,0.49606628692295651,86.437500000000156,85.088035515789471,171.52553551578961,82.490131578947526,30.654870526315786,113.14500210526332,3.9473684210526314,54.433164989473688,58.380533410526319]
[2006,7650000,666.55900000000054,225.56773880000003,234.80185400000002,460.36959280000008,30,101.93942849999999,60.726799999999997,234.80185400000002,636.55900000000054,225.56773880000003,862.12673880000057,0.73835895739184576,0.26164104260815424,30,397.46808250000004,427.46808250000004,7.0180678343394198E-2,0.92981932165660575,1289.5948213000006,0.51687474933255628,0.48312525066744372,87.131895424836671,81.44259101960786,168.57448644444452,83.210326797385704,29.485978928104579,112.69630572549028,3.9215686274509802,51.956612091503274,55.878180718954255]
[2007,7720000,669.22700000000077,247.46758760000003,259.22101840000005,506.68860600000005,30,104.49309779999997,58.650480000000002,259.22101840000005,639.22700000000077,247.46758760000003,886.69458760000077,0.72091000547345641,0.27908999452654359,30,422.36459620000005,452.36459620000005,6.6318187258704836E-2,0.93368181274129514,1339.0591838000009,0.49977402649288361,0.50022597350711628,86.687435233160727,86.765826917098451,173.45326215025918,82.80142487046642,32.055386994818655,114.85681186528507,3.8860103626943006,54.710439922279797,58.596450284974097]
[2008,7820000,685.4500000000005,250.92777459999991,258.12629820000006,509.05407279999997,30,108.19128264000001,61.690159999999999,258.12629820000006,655.4500000000005,250.92777459999991,906.37777460000041,0.72315321311719216,0.27684678688280778,30,428.00774084000011,458.00774084000011,6.5501076346393378E-2,0.93449892365360665,1364.3855154400005,0.50238733279057846,0.49761266720942149,87.653452685422067,86.820398393861893,174.47385107928397,83.817135549872191,32.087950716112523,115.90508626598472,3.836317135549872,54.73244767774937,58.568764813299239]
[2009,7900000,721.54499999999939,257.7309692,261.91418579999998,519.64515499999993,30,107.03987280000007,56.476399999999998,261.91418579999998,691.54499999999939,257.7309692,949.27596919999939,0.72849732052397542,0.27150267947602458,30,425.43045860000007,455.43045860000007,6.5871747120779853E-2,0.93412825287922019,1404.7064277999993,0.51366248898715239,0.48633751101284767,91.334810126582198,86.476130101265838,177.81094022784805,87.537341772151819,32.624173316455696,120.16151508860752,3.7974683544303796,53.851956784810135,57.649425139240513]
[2010,7970000,751.94399999999837,255.19096999999991,258.02092139999996,513.2118913999999,40,111.42258960000002,62.114319999999999,258.02092139999996,711.94399999999837,255.19096999999991,967.13496999999825,0.73613717018215119,0.26386282981784887,40,431.55783099999996,471.55783099999996,8.4825226876573706E-2,0.91517477312342632,1438.6928009999983,0.52265779009760904,0.47734220990239085,94.346800501881859,86.166725345043886,180.51352584692575,89.327979924717482,32.018942283563348,121.34692220828083,5.0188205771643668,54.147783061480546,59.166603638644915]
[2011,8050000,757.47300000000087,233.29902612000009,251.24740344999998,484.5464295700001,60,113.63388600689996,54.882963680000003,251.24740344999998,697.47300000000087,233.29902612000009,930.77202612000099,0.74934890652813657,0.25065109347186343,60,419.76425313689992,479.76425313689992,0.12506142257930813,0.87493857742069181,1410.5362792569008,0.5370106470420265,0.46298935295797361,94.096024844720603,81.125873199614915,175.22189804433552,86.642608695652271,28.981245480745354,115.62385417639763,7.4534161490683228,52.144627718869557,59.598043867937882]
[2012,8130000,765.43199999999968,243.24751817000006,240.51987572399995,483.76739389400001,60,117.83602063337999,54.802685599999997,240.51987572399995,705.43199999999968,243.24751817000006,948.67951816999971,0.7435935808551829,0.2564064191448171,60,413.15858195737997,473.15858195737997,0.126807379783306,0.87319262021669397,1421.8381001273797,0.53833977295405588,0.46166022704594417,94.149077490774872,80.738757703244772,174.88783519401966,86.769003690036854,29.919743932349334,116.68874762238619,7.3800738007380078,50.819013770895438,58.199087571633449]
[2013,8210000,812.18999999999983,253.06505301920004,229.25124227999999,482.31629529920002,60,121.12006102392004,49.331181999999998,229.25124227999999,752.18999999999983,253.06505301920004,1005.2550530191999,0.74825786524609827,0.25174213475390173,60,399.70248530392001,459.70248530392001,0.13051919865156397,0.86948080134843608,1464.9575383231199,0.55441197355773342,0.44558802644226658,98.926918392204612,79.508835362133993,178.43575375433861,91.618757612667466,30.824001585773452,122.44275919844091,7.3081607795371495,48.684833776360541,55.992994555897688]
[2014,8310000,837.13099999999849,245.28668491199997,221.29687884799995,466.58356375999995,65,120.68130213300002,52.8934736,221.29687884799995,772.13099999999849,245.28668491199997,1017.4176849119984,0.75891250117869136,0.24108749882130862,65,394.87165458099997,459.87165458099997,0.14134378440702777,0.85865621559297223,1477.2893394929984,0.56666692002752794,0.43333307997247211,100.73778580024049,77.034697893261139,177.77248369350161,92.915884476534103,29.517049929241875,122.43293440577598,7.8219013237063777,47.517647964019247,55.339549287725625]
[2015,8390000,888.83799999999883,236.34804659119996,194.77110273600002,431.11914932719998,70,119.47665802757996,46.112156720000002,194.77110273600002,818.83799999999883,236.34804659119996,1055.1860465911989,0.77601291511129489,0.22398708488870506,70,360.35991748357998,430.35991748357998,0.16265455298278514,0.83734544701721481,1485.5459640747788,0.59832413233580495,0.40167586766419511,105.94016686531572,71.121330640617401,177.06149750593312,97.596901072705464,28.170208175351604,125.76710924805707,8.34326579261025,42.95112246526579,51.294388257876037]
[2016,8470000,906.60800000000006,237.60478031780011,176.36082318500004,413.96560350280015,88.351142819999993,126.69985624799996,48.474655840000004,176.36082318500004,818.25685718000011,237.60478031780011,1055.8616374978003,0.77496598808071082,0.2250340119192891,88.351142819999993,351.53533527299999,439.88647809299999,0.20084987200111423,0.79915012799888574,1495.7481155908004,0.60612344454928635,0.39387655545071348,107.03754427390793,69.556093930436845,176.59363820434476,96.606476644628103,28.05251243421489,124.65898907884299,10.431067629279811,41.503581496221962,51.934649125501771]
["(6) 2017",8510000,940.16899999999907,230.07348724140007,187.4109490860001,417.4844363274002,101.36062970000002,123.59169548040002,46.011027839999997,187.4109490860001,838.80837029999907,230.07348724140007,1068.8818575413991,0.78475311783230539,0.21524688216769461,101.36062970000002,357.01367240640013,458.37430210640014,0.22113069871982413,0.77886930128017584,1527.2561596477992,0.615593523104082,0.38440647689591806,110.47814336075194,68.987915352267947,179.46605871301989,98.56737606345466,27.035662425546423,125.60303848900108,11.9107672972973,41.952252926721521,53.863020224018818]
[2018,8550000,973.55800000000227,241.41895795199994,166.43605328200002,407.85501123399996,103.19816317999999,121.75888605929995,41.916923839999995,166.43605328200002,870.35983682000233,241.41895795199994,1111.7787947720024,0.78285342454160678,0.21714657545839311,103.19816317999999,330.11186318130001,433.3100263613,0.23816241698028912,0.76183758301971094,1545.0888211333024,0.63009840384833682,0.36990159615166301,113.86643274853829,66.845710074070169,180.71214282260846,101.79647214269033,28.236135432982447,130.03260757567278,12.069960605847953,38.609574641087718,50.679535246935671]
[2019,8640000,1000.3510000000001,252.12360994840003,158.58762059200001,410.71123054040004,111.64366280000002,141.52111887060002,34.849647600000004,158.58762059200001,888.7073372000001,252.12360994840003,1140.8309471484001,0.77900002574561678,0.2209999742543832,111.64366280000002,334.95838706260002,446.60204986260004,0.24998466270888792,0.75001533729111203,1587.4329970110002,0.63016895949849538,0.36983104050150462,115.78136574074075,67.949305209606493,183.73067095034725,102.85964550925927,29.180973373657409,132.04061888291668,12.921720231481483,38.768331835949077,51.690052067430557]
[2020,8790000,1063.7330000000022,302.77018825219955,136.475006106,439.24519435819957,118.14357912,121.97570370635985,35.758097119999995,136.475006106,945.58942088000219,302.77018825219955,1248.3596091322017,0.7574655683848418,0.24253443161515814,118.14357912,294.20880693235983,412.35238605235986,0.28651120526073132,0.71348879473926863,1660.7119951845616,0.64052828129406347,0.35947171870593653,121.01626848691721,67.915699110871373,188.93196759778857,107.57558826848717,34.444845079886178,142.02043334837333,13.440680218430035,33.470854030985187,46.911534249415226]
[2021,8800000,1145.3840000000027,284.63706719820016,126.44893953360001,411.08600673180018,134.71399636000001,124.05305722067997,36.925819120000007,126.44893953360001,1010.6700036400027,284.63706719820016,1295.3070708382029,0.78025514288746267,0.21974485711253733,134.71399636000001,287.42781587427999,422.14181223428,0.31912023982413884,0.68087976017586116,1717.4488830724829,0.66691009629988685,0.3330899037001131,130.15727272727304,65.007373076418205,195.16464580369126,114.84886405000032,32.345121272522746,147.19398532252308,15.308408677272729,32.662251803895451,47.970660481168181]
[2022,8910000,1134.7349999999992,256.20701888240006,94.163949195999976,350.37096807840004,161.87722162,129.41452741560002,39.501503039999996,94.163949195999976,972.85777837999922,256.20701888240006,1229.0647972623992,0.7915431151774327,0.20845688482256736,161.87722162,263.07997965159996,424.95720127159996,0.38092594062558438,0.61907405937441562,1654.0219985339991,0.68604589358892631,0.3139541064110738,127.35521885521875,58.281369083501687,185.63658793872042,109.18718051402908,28.754996507564542,137.94217702159364,18.168038341189675,29.526372575937142,47.694410917126817]

{"sheet":"D.2.1 Imp.n.H.","index":15,"n_rows":36,"n_cols":25,"rows_kept":36,"cut":false,"hidden":false,"merged":[]}
[null,null,null,null,null,{"$f":"Codierung!I184","v":"Eidgenössisches Departement für  Wirtschaft, Bildung und Forschung WBF"}]
[null,null,null,null,null,{"$f":"Codierung!I185","v":"Bundesamt für Landwirtschaft BLW"}]
[null,null,null,null,null,{"$f":"Codierung!I186","v":"Fachbereich Marktanalysen"}]
[]
[null,null,null,null,null,{"$f":"Codierung!I242","v":"Anmerkungen:"}]
[{"$f":"Codierung!$I$171","v":"Importe nach Herkunft"},null,null,null,null,{"$f":"Codierung!I251","v":"Umrechnungsfaktoren: Eiprodukte getrocknet 80 Eier / kg; Eiprodukte flüssig 20.58 Eier / kg; Schaleneier 16.6 Eier / kg"}]
[{"$f":"Codierung!$I$222","v":"in Mio. Stück"},null,null,null,null,{"$f":"Codierung!I258","v":"Importe ohne Veredelungsverkehr, inklusive Rückwaren"}]
[{"$f":"Codierung!$I$206","v":"Quellen: BLW, Fachbereich Marktanalysen; EZV"}]
[{"$f":"Codierung!I215","v":"Publikationsrecht: Weiterverarbeitung und Publikation unter Quellenangabe gestattet."}]
[]
[{"$f":"Codierung!$I$154","v":"Zurück zum Inhaltsverzeichnis"}]
[]
[]
[null,{"$f":"Codierung!$I$40","v":"Konsumeier"},null,null,null,null,null,{"$f":"Codierung!$I$41","v":"Verarbeitungseier"},null,null,null,null,null,{"$f":"Codierung!$I$37","v":"Eiprodukte"},null,null,null,null,null,{"$f":"Codierung!$I$49","v":"Bruteier"}]
[null,{"$f":"Codierung!$I$198","v":"Niederlande"},{"$f":"Codierung!$I$188","v":"Deutschland"},{"$f":"Codierung!$I$189","v":"Frankreich"},{"$f":"Codierung!$I$201","v":"Bulgarien"},{"$f":"Codierung!$I$191","v":"Italien"},{"$f":"Codierung!$I$202","v":"Rest"},{"$f":"Codierung!$I$198","v":"Niederlande"},{"$f":"Codierung!$I$188","v":"Deutschland"},{"$f":"Codierung!$I$201","v":"Bulgarien"},{"$f":"Codierung!$I$189","v":"Frankreich"},{"$f":"Codierung!$I$200","v":"Polen"},{"$f":"Codierung!$I$202","v":"Rest"},{"$f":"Codierung!$I$198","v":"Niederlande"},{"$f":"Codierung!$I$188","v":"Deutschland"},{"$f":"Codierung!$I$191","v":"Italien"},{"$f":"Codierung!$I$199","v":"Belgien"},{"$f":"Codierung!$I$189","v":"Frankreich"},{"$f":"Codierung!$I$202","v":"Rest"},{"$f":"Codierung!$I$189","v":"Frankreich"},{"$f":"Codierung!$I$188","v":"Deutschland"},{"$f":"Codierung!$I$192","v":"Dänemark"},{"$f":"Codierung!$I$198","v":"Niederlande"},{"$f":"Codierung!$I$190","v":"Österreich"},{"$f":"Codierung!$I$202","v":"Rest"}]
[2002,68.706586600000009,93.959602200000006,59.215951600000018,0,6.5735999999999998E-3,2.6439649999999104,55.553510200000005,90.383696600000007,0.30424479999999998,6.6540435999999987,null,38.398040999999999,107.49165964000001,65.056352159999989,18.190185080000003,5.2367125199999993,32.519185899999997,13.842269820000082,0.77409119999999998,2.6748243999999999,null,1.1832480000000001,null,0.18895779999999981]
[2003,34.902877800000006,89.030232199999986,80.428842599999996,1.5025656000000001,7.3468114,9.9548706000000244,22.151106400000003,64.1859252,38.247279799999994,9.8395670000000024,4.4292949999999998,42.082128800000014,91.766746880000014,66.208814059999995,19.041385380000001,4.5611336400000004,28.061306480000002,8.2790572199999986,3.2587294,0.93536020000000009,null,0.13177079999999999,null,7.7687999999988822E-3]
[2004,43.903912399999996,82.155690800000002,86.558276399999997,2.6214055999999997,0.56420080000000006,15.090163600000142,30.443487000000001,59.440864999999995,66.571112800000009,11.308168999999999,13.201946799999998,30.374281599999936,87.177779579999992,42.623673419999996,16.473913300000003,5.4600258000000004,27.652221019999999,14.140052439999998,6.0625855999999994,null,null,null,null,1.8260000000055879E-4]
[2005,68.220389199999985,70.422628200000005,87.382881399999988,2.5848026000000002,1.66E-4,5.5390049999999702,57.631597800000002,69.44037299999998,41.959986000000001,12.645216000000001,12.480959,24.835807800000012,91.419588940000011,42.320211519999994,17.81278374,3.7008049999999999,19.116264739999995,20.775560379999995,12.127196400000001,1.1620000000000001E-3,null,5.64898E-2]
[2006,89.297359399999991,61.032223999999999,69.236176400000005,null,6.6400000000000001E-5,3.3117000000029803E-2,47.530082800000002,105.16523300000001,41.773451799999997,24.722114400000002,4.6775314000000003,10.933440599999994,88.029292139999981,33.841937999999999,13.464969979999999,2.8169713999999999,10.299310360000002,14.623186620000064,10.690217399999998,0.70968320000000007,null,9.1582200000000002E-2,null,7.4202000000000004E-2]
[2007,117.7595534,43.630991800000004,75.364431599999975,null,1.8072586000000002,0.50263140000003581,52.43111660000001,142.96804780000002,37.6851208,17.893272800000002,null,8.2434604000000054,89.13584339999997,25.77576316,11.315261260000003,4.1910758399999999,7.9002857799999999,25.763337639999957,13.1958214,null,null,5.0850946000000006]
[2008,141.85166459999999,34.980250399999996,70.09036260000002,null,0.87073639999999985,0.6725821999998689,106.5975806,107.27917660000001,8.4879286,26.741255400000004,null,9.0203570000000894,98.80384819999999,27.082263679999997,12.166095760000001,7.129300960000001,9.7123214400000002,15.036894560000091,10.832114199999999,null,1.5457421999999998,16.865716199999998]
[2009,121.45569279999999,56.321094200000005,78.648724999999999,null,2.4733999999999997E-3,1.752744200000018,98.814222400000006,98.68681740000001,9.6977365999999989,16.210381399999999,2.0877488000000004,36.417279199999989,96.290678399999976,26.29112924,16.841529959999995,9.4248014799999993,7.1018194800000005,5.9099304999999704,16.281927399999997,null,2.7844507999999997,10.033753800000001,null,5.9826400000002236E-2]
[2010,105.23966739999999,36.666279200000005,73.322963600000008,0,35.841740599999994,4.3140079999998511,72.166358599999995,110.99848959999998,7.2687415999999994,18.5576048,21.925612000000001,27.10411480000004,99.688433759999981,25.760209580000001,22.133047000000001,12.380270499999995,8.1165488599999982,6.3425941400000152,17.071323799999998,null,2.4028002000000002,9.6750609999999995,null,0.17366920000000299]
[2011,115.76398108000002,40.255351920000003,62.438584963999979,null,15.497950235999999,0.8300182600001097,71.904969023999996,108.46104016,1.2782514599999999,19.883559680000001,41.493476199999996,8.2261069260001189,91.330915818000022,34.014512066799988,14.40486317,13.716866388000001,9.3486116301000006,6.2884206360000077,16.820464600000001,0.17268979999999998,3.2639750000000003,10.751139399999998,0.18210200000000001,0.2124634000000134]
[2012,140.67627006000004,41.057302734000004,61.483939215999982,0,0.34378932000000001,0.46541419999995826,73.732145299999999,78.655164804000009,1.267161,16.17749182,57.378265200000001,13.309647599999964,98.028126139999998,36.666996813139995,12.987312476,15.563594364000007,8.2384531622400008,3.7126182199999094,20.399424600000007,4.0928865379999992,2.8327236,7.6910157199999993,0.77226519999999999,0.16375899999999255]
[2013,171.26213260400002,39.546928659999999,42.598129707200009,null,0.37880004799999994,0.56747763999998568,100.12544478000001,54.228777079999993,null,18.440023679999999,38.276877599999999,18.180119139999984,97.132429559999991,36.3935557402,12.96372657,14.437745809999996,8.9827021220199956,1.43962134769997,18.929079599999998,6.053346040000001,4.7970016000000006,9.7335892799999986,0.90554659999999998,0.13696410999999195]
[2014,161.232464064,47.518868669999996,34.445935244000012,null,0.48393614799999979,3.8871038079999982,164.40017134799999,16.858711000000003,0.33751120000000001,10.215689799999998,28.370462399999997,1.1143331000000238,105.12206540000004,35.926263068000011,10.684650770000003,12.172875270000002,5.0592850426000009,4.4404615423997642,18.003496800000001,8.7457929999999973,7.0625861999999984,8.3080343999999986,2.8687290000000005,0.32134280000000448]
[2015,155.49525705599999,44.948464080000008,32.221731555600009,null,0.64776055199999993,4.8929877800000607,122.62088232400002,21.974641759999997,2.481036,9.0302522599999993,32.551006399999999,6.1132839919999542,100.69634241999995,31.7490888548,12.819702196,10.16111042,5.2836391947800001,5.4182849240000248,13.323326000000002,6.8490271999999992,10.235227999999999,8.4608705999999998,6.4103755199999997,0.14768853999997675]
[2016,146.16757097600001,48.011691395599989,29.562017222599991,null,9.0478484260000016,4.9566112640001174,121.99176423599998,21.857865740000001,2.1731889999999998,7.0401645799999999,16.682402399999997,6.6154372290000616,104.14856933600002,29.539178566000007,16.429109588000003,13.286644159999998,5.4055943549999999,6.3964785830000643,13.069179999999998,9.7017577176000014,9.1504678000000013,6.6049075999999998,4.3731206000000009,0.16383137599999459]
[2017,131.15131456,59.329463943799986,25.807566720400004,0.89807660000000011,4.0663577459999996,11.133643903999955,121.585175788,42.790742461999997,5.9366414000000001,5.6103351999999989,2.8022791999999996,8.6857750360000736,94.064792267999977,31.813801885200004,14.698008262959998,12.920741039999998,9.1047334752400015,8.0965954799999,12.559576599999998,10.239442739999999,7.0305481999999992,7.0251531999999983,2.5862966000000003,0.15537135199999064]
[2018,131.228073956,37.917438214999997,24.015403811800009,1.3661268799999999,32.090045647999993,15.058227689999848,78.402083860000005,64.534170457999991,10.1038058,5.0023153799999989,0.32715279999999997,8.0665249840000577,97.806270303799991,31.320038625399995,9.1497949670000001,11.039484180000001,8.7753685833000006,5.7840997798000275,13.679445799999998,12.587419779999998,9.2427471999999984,5.5004265999999991,3.6138366000000004,0.14289280000002683]
[2019,139.24789915599999,43.314881436200004,22.303220466799992,8.9225614199999992,27.746726430400006,11.338179957399875,62.723158100000006,60.188185379999993,14.48905768,4.2500814,0,16.937138032000004,99.994438059999993,44.657305229800002,8.2102427224000003,6.142884780000001,11.002084771000002,6.8828875343998668,14.859954302,10.45212858,9.8391851999999993,7.9039405999999994,1.1913819999999999,0.17395405600000172]
[2020,176.17717779999995,41.534507465799997,19.494140711599997,13.988712431999998,35.844108058800003,16.37599295999992,81.47202361799998,16.465629307999997,22.084786743999999,2.4303561999999999,0.64567359999999996,13.376536635999992,88.560533091999986,38.990638216400001,8.4774751431600031,6.3412626000000003,10.885813017999999,4.7541594506002065,15.067056399999998,14.04543679,11.588526399999999,4.9398611999999993,"",0.1465247140000239]
[2021,173.23588107000003,67.609911999000005,21.469935243800002,7.1218614800000006,1.6653717932000001,15.286069512599946,68.594451939999999,21.298206201999999,20.377739953599995,0.12974560000000002,0,16.048795837999954,83.427017661999997,44.041592995999991,10.054078289879998,7.0935831783599994,12.30479053024,5.7168061331999303,14.346919184000001,13.731361802,13.496596800000001,5.0290944999999994,"",0.1278133599999845]
[2022,209.75133482799995,17.485907222999998,21.142318722799999,2.5209477120000003,1.5101846182000003,12.490064996399969,52.822893200000003,17.284226602,5.7816807319999999,0,0.3331288,17.942019861999988,89.196105500740003,48.639495346899992,6.2798839704000002,8.2894482467999993,12.897572374660001,5.3523848980398476,14.267766399999999,13.965676778000001,13.629529600000001,6.2320715999999994,0.49619059999999998,0.12943567800001801]

{"sheet":"D.2.2 Imp.n.Kont.","index":16,"n_rows":36,"n_cols":13,"rows_kept":36,"cut":false,"hidden":false,"merged":[]}
[null,null,null,null,null,{"$f":"Codierung!I184","v":"Eidgenössisches Departement für  Wirtschaft, Bildung und Forschung WBF"}]
[null,null,null,null,null,{"$f":"Codierung!I185","v":"Bundesamt für Landwirtschaft BLW"}]
[null,null,null,null,null,{"$f":"Codierung!I186","v":"Fachbereich Marktanalysen"}]
[]
[null,null,null,null,null,{"$f":"Codierung!I242","v":"Anmerkungen:"}]
[{"$f":"Codierung!$I$172","v":"Auslastung der Importkontingente"},null,null,null,null,{"$f":"Codierung!I259","v":"Die Zollkontingente beziehen sich auf Brutto-Mengen"}]
[{"$f":"Codierung!$I$219","v":"in Tonnen"},null,null,null,"(1)",{"$f":"Codierung!I264","v":"Das BLW hat auf Anträgen der Branche das Kontingent für Konsumeierimporte um insgesamt 3'000 Tonnen erhöht infolge der hohen Nachfrage nach Schaleneiern wegen des vermehrten pandemiebedingten Konsums zu Hause"}]
[{"$f":"Codierung!$I$206","v":"Quellen: BLW, Fachbereich Marktanalysen; EZV"},null,null,null,"(2)",{"$f":"Codierung!I380","v":"Das BLW hat auf Anträgen der Branche das Kontingent für Konsumeierimporte um insgesamt 3'500 Tonnen erhöht infolge der hohen Nachfrage nach Schaleneiern wegen des vermehrten pandemiebedingten Konsums zu Hause"}]
[{"$f":"Codierung!I215","v":"Publikationsrecht: Weiterverarbeitung und Publikation unter Quellenangabe gestattet."},null,null,null,"(3)",{"$f":"Codierung!I381","v":"Die Überschreitung der Kontingentsmenge ist möglich."}]
[]
[{"$f":"Codierung!$I$154","v":"Zurück zum Inhaltsverzeichnis"}]
[]
[null,{"$f":"Codierung!$I$40","v":"Konsumeier"},null,null,{"$f":"Codierung!$I$41","v":"Verarbeitungseier"},null,null,{"$f":"Codierung!$I$44","v":"Eiprodukte getrocknet"},null,null,{"$f":"Codierung!$I$43","v":"Eiprodukte flüssig"}]
[null,{"$f":"Codierung!$I$50","v":"Kontingentsmenge"},{"$f":"Codierung!$I$51","v":"Zugeteilte / Eingeführte Menge"},{"$f":"Codierung!$I$52","v":"Auslastung"},{"$f":"Codierung!$I$50","v":"Kontingentsmenge"},{"$f":"Codierung!$I$51","v":"Zugeteilte / Eingeführte Menge"},{"$f":"Codierung!$I$52","v":"Auslastung"},{"$f":"Codierung!$I$50","v":"Kontingentsmenge"},{"$f":"Codierung!$I$51","v":"Zugeteilte / Eingeführte Menge"},{"$f":"Codierung!$I$52","v":"Auslastung"},{"$f":"Codierung!$I$50","v":"Kontingentsmenge"},{"$f":"Codierung!$I$51","v":"Zugeteilte / Eingeführte Menge"},{"$f":"Codierung!$I$52","v":"Auslastung"}]
[]
[2002,19428,14546.68,{"$f":"C16/B16","v":0.74874819847642582},14307,12101.31,{"$f":"F16/E16","v":0.84583141119731597},977,728.29600000000005,0.74544114636642789,6866,9562.277,1.3926998252257501]
[2003,19428,14360.965,{"$f":"C17/B17","v":0.73918905703108917},14307,11461.183999999999,{"$f":"F17/E17","v":0.80108925700705946},977,690.96500000000003,0.70723132036847491,6866,8539.7119999999995,1.24376813282843]
[2004,19428,14853.130999999999,0.76452187564340124,14307,13398.584000000001,0.93650548682463131,977,676.697,0.69262743091095191,6866,7200.6059999999998,1.0487337605592777]
[2005,16428,14988.781000000001,0.91239231799366938,17307,13737.199000000001,0.79373658057433416,977,859.89800000000002,0.8801412487205732,6866,6540.4560000000001,0.95258607631808911]
[2006,16428,15370.53,0.93563002191380573,17307,14217.052,0.8214625296122956,977,743.62,0.76112589559877175,6866,5196.174,0.75679784445091758]
[2007,16428,16004.2,0.97420258095933776,17307,16704.058000000001,0.9651619575894147,977,751.97799999999995,0.76968065506653016,6866,5392.1779999999999,0.78534488785318968]
[2008,16428,16195.682560000001,0.98585844655466282,19307,16570.598699999999,0.85826895426529226,977,800.06899999999996,0.81890378710337763,6866,5545.3869999999997,0.80765904456743376]
[2009,17428,16337.7156,0.93744064723433551,18307,16946.301199999998,0.92567330529305725,977,704.69,0.72127942681678603,6866,5527.192,0.80500903000291291]
[2010,16428,16367.952300000001,0.99634479547114685,17307,16627.623100000001,0.96074554226613518,977,805.70500000000004,0.8246724667349028,6866,5762.1549999999997,0.839230265074279]
[2011,16428,15130.7379,0.92103347333820307,17307,16301.806399999999,0.9419198243485295,977,708.26400000000001,0.72493756397134079,6866,5899.7330000000002,0.85926784153801339]
[2012,16428,15952.5167,0.97105653153153149,17307,15677.918900000001,0.90587154908418566,977,752.03700000000003,0.76974104401228249,6866,6113.3069999999998,0.89037387124963585]
[2013,17428,16795.686100000003,0.96371850470507248,17307,15039.804300000002,0.86900123071589541,977,663.72199999999998,0.67934698055271237,6866,6389.13,0.93054616953102243]
[2014,16428,16403.271699999998,0.99849474677380068,17307,14427.718199999999,0.83363484139365573,977,690.74400000000003,0.70700511770726715,6866,6334.3310000000001,0.9225649577628896]
[2015,17428,15768.0424,0.90475340830846918,17307,12777.5478,0.73828784884728726,977,614.375,0.62883828045035828,6866,6235.3980000000001,0.90815584037285169]
[2016,17428,15863.589900000001,0.91023582166628414,17307,11632.9002,0.67215000866701335,977,641.64200000000005,0.65674718526100306,6866,6540.6769999999997,0.95261826390911741]
[2017,17428,15745.9797,0.90348747417948128,17307,12378.9126,0.71525467152019417,977,610.86099999999999,0.62524155578300922,6866,6473.8739999999998,0.94288872706087967]
[2018,17428,16262.303800000002,{"$f":"C32/B32","v":0.93311359880651834},16307,11046.939199999999,{"$f":"F32/E32","v":0.67743540810694791},977,545.25800000000004,0.5580941658137154,6866,6405.7790000000005,0.93297101660355375]
[2019,17428,16913.070199999998,{"$f":"C33/B33","v":0.97045387881569878},15973.666666666699,10502.376400000001,{"$f":"F33/E33","v":0.65748062853446176},977,616.875,0.63139713408393039,6866,6467.3630000000003,0.94194043110981651]
["(1) 2020",20428,20221.614000000001,0.98989690620716675,16307,9049.6260000000002,0.55495345557122711,977,591.21699999999998,0.60513510747185262,6866,5647.415,0.82251893387707542]
["(2) 2021",20928,19057.52,0.91062308868501529,16307,8906.09,0.54615134604770954,977,481.666,0.49300511770726713,6866,6625.4219999999996,0.96496096708418289]
[2022,17428,17428,{"$f":"C36/B36","v":1},16307,6345.2159000000001,{"$f":"F36/E36","v":0.38910994664867848},977,680.23,0.69624360286591602,6866,10294.475199999999,1.4993409845616079]

{"sheet":"D.2.3 aVV","index":17,"n_rows":36,"n_cols":15,"rows_kept":36,"cut":false,"hidden":false,"merged":[]}
[null,null,null,null,null,{"$f":"Codierung!I184","v":"Eidgenössisches Departement für  Wirtschaft, Bildung und Forschung WBF"}]
[null,null,null,null,null,{"$f":"Codierung!I185","v":"Bundesamt für Landwirtschaft BLW"}]
[null,null,null,null,null,{"$f":"Codierung!I186","v":"Fachbereich Marktanalysen"}]
[]
[null,null,null,null,null,{"$f":"Codierung!I242","v":"Anmerkungen:"}]
[{"$f":"Codierung!$I$174","v":"Aktiver Veredelungsverkehr (ohne Produkte für technische Zwecke)"},null,null,null,null,{"$f":"Codierung!I251","v":"Umrechnungsfaktoren: Eiprodukte getrocknet 80 Eier / kg; Eiprodukte flüssig 20.58 Eier / kg; Schaleneier 16.6 Eier / kg"}]
[{"$f":"Codierung!$I$222","v":"in Mio. Stück"}]
[{"$f":"Codierung!$I$206","v":"Quellen: BLW, Fachbereich Marktanalysen; EZV"}]
[{"$f":"Codierung!I215","v":"Publikationsrecht: Weiterverarbeitung und Publikation unter Quellenangabe gestattet."}]
[]
[{"$f":"Codierung!$I$154","v":"Zurück zum Inhaltsverzeichnis"}]
[{"$f":"Codierung!$I$253","v":"Informationen zur Methodik"}]
[null,{"$f":"Codierung!$I$45","v":"Import"},null,null,null,null,null,null,{"$f":"Codierung!$I$54","v":"Re-Export"}]
[null,{"$f":"Codierung!$I$28","v":"Schaleneier"},null,null,{"$f":"Codierung!$I$37","v":"Eiprodukte"},null,null,{"$f":"Codierung!$I$36","v":"Total"},{"$f":"Codierung!$I$28","v":"Schaleneier"},null,null,{"$f":"Codierung!$I$37","v":"Eiprodukte"},null,null,{"$f":"Codierung!$I$36","v":"Total"}]
[null,{"$f":"Codierung!$I$40","v":"Konsumeier"},{"$f":"Codierung!$I$41","v":"Verarbeitungseier"},{"$f":"Codierung!$I$36","v":"Total"},{"$f":"Codierung!$I$43","v":"Eiprodukte flüssig"},{"$f":"Codierung!$I$44","v":"Eiprodukte getrocknet"},{"$f":"Codierung!$I$36","v":"Total"},null,{"$f":"Codierung!$I$40","v":"Konsumeier"},{"$f":"Codierung!$I$41","v":"Verarbeitungseier"},{"$f":"Codierung!$I$36","v":"Total"},{"$f":"Codierung!$I$43","v":"Eiprodukte flüssig"},{"$f":"Codierung!$I$44","v":"Eiprodukte getrocknet"},{"$f":"Codierung!$I$36","v":"Total"}]
[2002,"-",2.8424346000000003,2.8424346000000003,39.1182582,51.201839999999997,90.32009819999999,93.162532799999994,"-","-","-",0.21716015999999999,"-",0.21716015999999999,0.21716015999999999]
[2003,"-",4.0742044000000002,4.0742044000000002,50.462057100000003,40.043999999999997,90.506057099999992,94.580261499999992,"-","-","-","-","-","-","-"]
[2004,"-",1.3055568,1.3055568,63.992830860000005,47.212400000000002,111.20523086,112.51078766000001,"-","-","-","-","-","-","-"]
[2005,"-",5.1771084000000007,5.1771084000000007,58.717827,41.955280000000002,100.673107,105.8502154,"-","-","-","-","-","-","-"]
[2006,"-",7.7110154,7.7110154,51.102403799999998,50.310400000000001,101.41280380000001,109.1238192,0.17725479999999999,"-",0.17725479999999999,9.7549200000000003E-2,6.1600000000000002E-2,0.15914919999999999,0.33640399999999998]
[2007,"-",11.656005400000002,11.656005400000002,38.670108120000002,63.264719999999997,101.93482811999999,113.59083351999999,3.7814800000000003E-2,"-",3.7814800000000003E-2,0.41194986,0.31359999999999999,0.72554985999999999,0.76336466000000003]
[2008,"-",32.194870000000002,32.194870000000002,30.409440179999997,50.252400000000002,80.661840179999999,112.85671017999999,"-","-","-",2.0516202000000003,1.6E-2,2.0676202000000004,2.0676202000000004]
[2009,"-",7.8688149999999997,7.8688149999999997,33.631218599999997,54.487360000000002,88.118578600000006,95.987393600000004,"-","-","-",2.4548029799999993,0.99695999999999996,3.4517629799999994,3.4517629799999994]
[2010,"-",27.254544000000003,27.254544000000003,19.751140500000002,49.080240000000003,68.831380500000009,96.085924500000004,"-","-","-",4.2409000199999998,0.24399999999999999,4.4849000199999995,4.4849000199999995]
[2011,"-",16.2063144,16.2063144,18.668735400000003,21.765999999999998,40.434735400000001,56.641049800000005,"-","-","-",4.4215111290000007,"-",4.4215111290000007,4.4215111290000007]
[2012,2.4238656000000001,13.767402559999997,16.191268159999996,16.053429000000001,21.598199999999999,37.651629,53.842897159999993,"-","-","-",3.8358547499999989,"-",3.8358547499999989,3.8358547499999989]
[2013,11.4296644,3.6238464000000006,15.053510800000002,21.908644800000001,20.900400000000001,42.809044800000002,57.862555600000007,"-","-","-",4.9074841619999994,1.0160000000000001E-2,4.9176441619999993,4.9176441619999993]
[2014,10.889981799999999,3.3454727000000002,14.235454499999999,24.004511999999998,18.7424,42.746911999999995,56.982366499999998,"-","-","-",7.0676401949999992,"-",7.0676401949999992,7.0676401949999992]
[2015,10.387034999999997,6.7726638799999996,17.159698879999997,24.292343879999994,17.598320000000001,41.890663879999991,59.050362759999985,"-","-","-",6.2670082229999995,"-",6.2670082229999995,6.2670082229999995]
[2016,14.797273199999999,0.9699546,15.767227799999999,26.238697379999998,14.672000000000001,40.910697380000002,56.677925180000003,"-","-","-",6.8734421700000015,"-",6.8734421700000015,6.8734421700000015]
[2017,14.062465900000003,2.4323711079999999,16.494837008000005,30.381039780000002,11.4992,41.880239780000004,58.375076788000008,3.32E-3,"-",3.32E-3,10.142266469999999,0.222,10.364266469999999,10.367586469999999]
[2018,15.134452400000004,0.30558940000000001,15.440041800000005,32.792573310000002,13.862399999999999,46.654973310000003,62.095015110000006,2.2609199999999999E-2,"-",2.2609199999999999E-2,5.3687869199999989,"-",5.3687869199999989,5.3913961199999987]
[2019,12.534185239999998,0.29848459999999999,12.832669839999998,33.393231479999997,11.0604,44.453631479999999,57.286301319999993,4.411284E-2,"-",4.411284E-2,4.1902937999999983,"-",4.1902937999999983,4.2344066399999987]
[2020,11.065858800000001,0.32462628000000004,11.390485080000001,39.233197500000017,9.1539999999999999,48.387197500000013,59.777682580000018,4.0022599999999998E-2,"-",4.0022599999999998E-2,4.4172912000000002,1.6E-2,4.4332912000000002,4.4733138000000006]
[2021,8.9673863999999988,"-",8.9673863999999988,42.425937540000007,10.066000000000001,52.491937540000009,61.459323940000004,1.5188999999999999E-2,"-",1.5188999999999999E-2,3.6463541100000003,"-",3.6463541100000003,3.6615431100000002]
[2022,3.2614019999999999,"-",3.2614019999999999,39.814150320000003,8.2560000000000002,48.070150320000003,51.33155232,"-","-","-",5.0216640600000009,"-",5.0216640600000009,5.0216640600000009]

{"sheet":"D.2.4 Imp.LM","index":18,"n_rows":32,"n_cols":7,"rows_kept":32,"cut":false,"hidden":true,"merged":[]}
[null,null,null,null,null,{"$f":"Codierung!I184","v":"Eidgenössisches Departement für  Wirtschaft, Bildung und Forschung WBF"}]
[null,null,null,null,null,{"$f":"Codierung!I185","v":"Bundesamt für Landwirtschaft BLW"}]
[null,null,null,null,null,{"$f":"Codierung!I186","v":"Fachbereich Marktanalysen"}]
[]
[{"$f":"Codierung!$I$157","v":"\"Versteckte\" Eierimporte in Lebensmittelzubereitungen"}]
[{"$f":"Codierung!$I$222","v":"in Mio. Stück"}]
[{"$f":"Codierung!$I$224","v":"in %"}]
[{"$f":"Codierung!$I$223","v":"in Stück / Kopf"}]
[{"$f":"Codierung!$I$210","v":"Quellen: BLW, Fachbereich Marktanalysen; SBV; EZV; Aviforum"}]
[{"$f":"Codierung!$I$215","v":"Publikationsrecht: Weiterverarbeitung und Publikation unter Quellenangabe gestattet."}]
[{"$f":"Codierung!$I$154","v":"Zurück zum Inhaltsverzeichnis"}]
[]
[null,{"$f":"Codierung!$I$158","v":"Eier in importieren Lebensmittelzubereitungen"},null,{"$f":"Codierung!$I$27","v":"Bevölkerung"},{"$f":"Codierung!$I$31","v":"Pro-Kopf-Verbrauch"}]
[null,{"$f":"Codierung!$I$220","v":"in Stück"},{"$f":"Codierung!$I$222","v":"in Mio. Stück"},{"$f":"Codierung!$I$225","v":"in Anz. Personen"},{"$f":"Codierung!$I$223","v":"in Stück / Kopf"}]
[null,null,null,null,{"$f":"Codierung!$I$159","v":"statistisch erfasster Verbrauch"},{"$f":"Codierung!$I$160","v":"importierte Lebensmittelzubereitungen"},{"$f":"Codierung!$I$36","v":"Total"}]
[2005,{"$f":"[1]Pivot_Menge!AR11","v":62001082.993360125},{"$f":"B16/1000000","v":62.001082993360122},{"$f":"[2]Vertikal!B19","v":7600000},{"$f":"'D.1 Prod + AH + Verbrauch'!Z33","v":171.52553551578961},{"$f":"B16/D16","v":8.1580372359684379},{"$f":"SUM(E16:F16)","v":179.68357275175805}]
[2006,{"$f":"[1]Pivot_Menge!AR12","v":73548156.62368007},73.548156623680072,{"$f":"[2]Vertikal!B20","v":7650000},{"$f":"'D.1 Prod + AH + Verbrauch'!Z34","v":168.57448644444452},9.6141381207424921,178.18862456518701]
[2007,{"$f":"[1]Pivot_Menge!AR13","v":82793182.067440048},82.793182067440043,{"$f":"[2]Vertikal!B21","v":7720000},{"$f":"'D.1 Prod + AH + Verbrauch'!Z35","v":173.45326215025918},10.724505449150266,184.17776759940944]
[2008,{"$f":"[1]Pivot_Menge!AR14","v":92015454.767679915},92.015454767679913,{"$f":"[2]Vertikal!B22","v":7820000},{"$f":"'D.1 Prod + AH + Verbrauch'!Z36","v":174.47385107928397},11.766682195355488,186.24053327463946]
[2009,{"$f":"[1]Pivot_Menge!AR15","v":90752231.86536032},90.752231865360315,{"$f":"[2]Vertikal!B23","v":7900000},{"$f":"'D.1 Prod + AH + Verbrauch'!Z37","v":177.81094022784805},11.487624286754471,189.29856451460253]
[2010,{"$f":"[1]Pivot_Menge!AR16","v":98168313.303502306},98.168313303502302,{"$f":"[2]Vertikal!B24","v":7970000},{"$f":"'D.1 Prod + AH + Verbrauch'!Z38","v":180.51352584692575},12.317228770828395,192.83075461775414]
[2011,{"$f":"[1]Pivot_Menge!AR17","v":107572677.92258279},107.57267792258278,{"$f":"[2]Vertikal!B25","v":8050000},{"$f":"'D.1 Prod + AH + Verbrauch'!Z39","v":175.22189804433552},13.363065580445067,188.58496362478058]
[2012,{"$f":"[1]Pivot_Menge!AR18","v":113025257.22394875},113.02525722394874,{"$f":"[2]Vertikal!B26","v":8130000},{"$f":"'D.1 Prod + AH + Verbrauch'!Z40","v":174.88783519401966},13.902245661002306,188.79008085502196]
[2013,{"$f":"[1]Pivot_Menge!AR19","v":117347202.24695383},117.34720224695383,{"$f":"[2]Vertikal!B27","v":8210000},{"$f":"'D.1 Prod + AH + Verbrauch'!Z41","v":178.43575375433861},14.293203684160028,192.72895743849864]
[2014,{"$f":"[1]Pivot_Menge!AR20","v":123412103.40321799},123.41210340321798,{"$f":"[2]Vertikal!B28","v":8310000},{"$f":"'D.1 Prod + AH + Verbrauch'!Z42","v":177.77248369350161},14.851035307246448,192.62351900074805]
[2015,{"$f":"[1]Pivot_Menge!AR21","v":144237934.5080086},144.23793450800861,{"$f":"[2]Vertikal!B29","v":8390000},{"$f":"'D.1 Prod + AH + Verbrauch'!Z43","v":177.06149750593312},17.191648928248938,194.25314643418204]
[2016,{"$f":"[1]Pivot_Menge!AR22","v":153756986.23988068},153.75698623988069,{"$f":"[2]Vertikal!B30","v":8470000},{"$f":"'D.1 Prod + AH + Verbrauch'!Z44","v":176.59363820434476},18.153127064920977,194.74676526926572]
[2017,{"$f":"[1]Pivot_Menge!AR23","v":150252573.96936229},150.25257396936229,{"$f":"[2]Vertikal!B31","v":8510000},{"$f":"'D.1 Prod + AH + Verbrauch'!Z45","v":179.46605871301989},17.656001641523183,197.12206035454307]
[2018,{"$f":"[1]Pivot_Menge!AR24","v":144827053.03371456},144.82705303371455,{"$f":"[2]Vertikal!B32","v":8550000},{"$f":"'D.1 Prod + AH + Verbrauch'!Z46","v":180.71214282260846},16.938836612130359,197.65097943473882]
[2019,{"$f":"[1]Pivot_Menge!AR25","v":150065609.82719734},{"$f":"B30/1000000","v":150.06560982719733},{"$f":"[2]Vertikal!B33","v":8640000},{"$f":"'D.1 Prod + AH + Verbrauch'!Z47","v":183.73067095034725},{"$f":"B30/D30","v":17.368704841110805},{"$f":"SUM(E30:F30)","v":201.09937579145804}]
[2020,{"$f":"[1]Pivot_Menge!AR26","v":164091024.62364349},164.09102462364348,{"$f":"[2]Vertikal!B34","v":8790000},{"$f":"'D.1 Prod + AH + Verbrauch'!Z48","v":188.93196759778857},18.667920890061829,207.59988848785039]
[2021,{"$f":"[1]Pivot_Menge!AR27","v":172775109.32241321},172.77510932241321,{"$f":"[2]Vertikal!B35","v":8800000},{"$f":"'D.1 Prod + AH + Verbrauch'!Z49","v":195.16464580369126},19.633535150274227,214.79818095396547]

{"sheet":"D.3 MEM","index":19,"n_rows":39,"n_cols":13,"rows_kept":39,"cut":false,"hidden":false,"merged":[]}
[null,null,null,null,null,{"$f":"Codierung!I184","v":"Eidgenössisches Departement für  Wirtschaft, Bildung und Forschung WBF"}]
[null,null,null,null,null,{"$f":"Codierung!I185","v":"Bundesamt für Landwirtschaft BLW"}]
[null,null,null,null,null,{"$f":"Codierung!I186","v":"Fachbereich Marktanalysen"}]
[]
[null,null,null,{"$f":"Codierung!I242","v":"Anmerkungen:"}]
[{"$f":"Codierung!I173","v":"Marktentlastungsmassnahmen "},null,null,"(1)",{"$f":"Codierung!I247","v":"Deckelung der ausbezahlten Mittel (rot markiert); Kürzung der Beiträge je Ei"}]
[{"$f":"Codierung!$I$220","v":"in Stück"}]
[{"$f":"Codierung!$I$221","v":"in CHF"}]
[{"$f":"Codierung!$I$217","v":"in CHF / Ei"}]
[{"$f":"Codierung!I205","v":"Quellen: BLW, Fachbereich Marktanalysen"}]
[{"$f":"Codierung!I215","v":"Publikationsrecht: Weiterverarbeitung und Publikation unter Quellenangabe gestattet."}]
[]
[{"$f":"Codierung!$I$154","v":"Zurück zum Inhaltsverzeichnis"}]
[{"$f":"Codierung!$I$253","v":"Informationen zur Methodik"}]
[null,{"$f":"Codierung!$I$55","v":"Aufschlagsaktion"},null,{"$f":"Codierung!$I$56","v":"Verbilligungsaktion"},null,{"$f":"Codierung!$I$57","v":"Eingesetzte Mittel"},null,null,{"$f":"Codierung!$I$58","v":"Maximal zur Verfügung stehende Bundesmittel"},null,null,{"$f":"Codierung!$I$59","v":"Auslastung Mittel"},{"$f":"Codierung!$I$61","v":"Anteil betroffene Eier an Inlandproduktion"}]
[null,{"$f":"Codierung!$I$60","v":"Beitrag"},null,{"$f":"Codierung!$I$60","v":"Beitrag"},null,{"$f":"Codierung!$I$55","v":"Aufschlagsaktion"},{"$f":"Codierung!$I$56","v":"Verbilligungsaktion"},{"$f":"Codierung!$I$36","v":"Total"},{"$f":"Codierung!$I$55","v":"Aufschlagsaktion"},{"$f":"Codierung!$I$56","v":"Verbilligungsaktion"},{"$f":"Codierung!$I$36","v":"Total"}]
[null,{"$f":"Codierung!$I$217","v":"in CHF / Ei"},{"$f":"Codierung!$I$220","v":"in Stück"},{"$f":"Codierung!$I$217","v":"in CHF / Ei"},{"$f":"Codierung!$I$220","v":"in Stück"},{"$f":"Codierung!$I$221","v":"in CHF"},{"$f":"Codierung!$I$221","v":"in CHF"},{"$f":"Codierung!$I$221","v":"in CHF"},{"$f":"Codierung!$I$221","v":"in CHF"},{"$f":"Codierung!$I$221","v":"in CHF"},{"$f":"Codierung!$I$221","v":"in CHF"}]
[2001,8.4999999999999992E-2,7853044,0.05,8505950,667508.74,425297.5,1092806.24,null,null,2500000,0.43712249599999997,{"$f":"SUM(C18,E18)/1000000/'D.1 Prod + AH + Verbrauch'!C29","v":2.4057344117647022E-2}]
[2002,0.09,18572484,0.05,12552369,1671523.5599999998,627618.45000000007,2299142.0099999998,null,null,3000000,0.76638066999999988,{"$f":"SUM(C19,E19)/1000000/'D.1 Prod + AH + Verbrauch'!C30","v":4.4274328591749582E-2}]
[2003,0.09,16945352.999999996,4.9999999999999996E-2,11864069,1525081.7699999996,593203.44999999995,2118285.2199999997,null,null,3000000,0.70609507333333321,{"$f":"SUM(C20,E20)/1000000/'D.1 Prod + AH + Verbrauch'!C31","v":4.1718926668211399E-2}]
[2004,0.09,13719539,0.05,10939028,1234758.51,546951.4,1781709.9100000001,null,null,3000000,0.59390330333333341,{"$f":"SUM(C21,E21)/1000000/'D.1 Prod + AH + Verbrauch'!C32","v":3.7836659194029267E-2}]
[2005,8.9999999999999983E-2,20255114,0.05,13875336,1822960.2599999995,693766.8,2516727.0599999996,null,null,3000000,0.83890901999999989,{"$f":"SUM(C22,E22)/1000000/'D.1 Prod + AH + Verbrauch'!C33","v":5.1954865471705206E-2}]
[2006,0.09,19036256,0.05,13204506,1713263.04,660225.30000000005,2373488.34,null,null,3000000,0.79116277999999995,{"$f":"SUM(C23,E23)/1000000/'D.1 Prod + AH + Verbrauch'!C34","v":4.8368954586165622E-2}]
[2007,0.09,7436238,0.05,10316424,669261.41999999993,515821.2,1185082.6199999999,null,null,2815000,0.42098849733570154,{"$f":"SUM(C24,E24)/1000000/'D.1 Prod + AH + Verbrauch'!C35","v":2.6527115612490201E-2}]
[2008,9.0000000000000011E-2,8376879.9999999991,0.05,14084488,753919.2,704224.4,1458143.6,null,null,2500000,0.58325744000000002,{"$f":"SUM(C25,E25)/1000000/'D.1 Prod + AH + Verbrauch'!C36","v":3.2768791304982108E-2}]
[2009,8.9999999999999983E-2,7656674,5.000000000000001E-2,20439198,689100.65999999992,1021959.9000000003,1711060.56,null,null,2000000,0.85553027999999998,{"$f":"SUM(C26,E26)/1000000/'D.1 Prod + AH + Verbrauch'!C37","v":3.8938488936933975E-2}]
[2010,8.4801482556052396E-2,17688370,4.35167826824093E-2,11489820,1500000.0000000005,500000,2000000.0000000005,1500000,500000,2000000,1.0000000000000002,{"$f":"SUM(C27,E27)/1000000/'D.1 Prod + AH + Verbrauch'!C38","v":3.8803674209781668E-2}]
[2011,0.09,15357431,0.05,9021673,1382168.79,451083.65,1833252.44,1500000,500000,2000000,0.91662621999999994,{"$f":"SUM(C28,E28)/1000000/'D.1 Prod + AH + Verbrauch'!C39","v":3.2184782823942208E-2}]
[2012,0.09,13056968,0.05,8873544,1175127.1199999999,443677.2,1618804.3199999998,1500000,500000,2000000,0.80940215999999987,{"$f":"SUM(C29,E29)/1000000/'D.1 Prod + AH + Verbrauch'!C40","v":2.8651156471116976E-2}]
[2013,0.09,13195207,0.05,7377472,1187568.6299999999,368873.60000000003,1556442.23,1500000,500000,2000000,0.77822111500000002,{"$f":"SUM(C30,E30)/1000000/'D.1 Prod + AH + Verbrauch'!C41","v":2.5329884632906099E-2}]
[2014,0.09,11831044.000000002,4.9999999999999996E-2,5443141,1064793.9600000002,272157.05,1336951.0100000002,1500000,400000,1900000,0.70365842631578956,{"$f":"SUM(C31,E31)/1000000/'D.1 Prod + AH + Verbrauch'!C42","v":2.0634984249776951E-2}]
[2015,0.09,15861790.999999998,0.05,8022976,1427561.1899999997,401148.80000000005,1828709.9899999998,1500000,400000,1900000,0.96247894210526308,{"$f":"SUM(C32,E32)/1000000/'D.1 Prod + AH + Verbrauch'!C43","v":2.6871901291348966E-2}]
[2016,0.09,14459831,0.05,7876848,1301384.79,393842.4,1695227.19,1500000,400000,1900000,0.89222483684210518,{"$f":"SUM(C33,E33)/1000000/'D.1 Prod + AH + Verbrauch'!C44","v":2.4637637214760953E-2}]
[2017,8.8888136000000006E-2,16875142.932460636,4.1007556000000001E-2,9754299.914874224,1500000,400000,1900000,1500000,400000,1900000,1,{"$f":"SUM(C34,E34)/1000000/'D.1 Prod + AH + Verbrauch'!C45","v":2.8324102206448935E-2}]
[2018,9.0000000000000011E-2,14886979,4.9999999999999996E-2,8455344,1339828.1100000001,422767.19999999995,1762595.31,1550000,450000,2000000,0.88129765500000001,{"$f":"SUM(C35,E35)/1000000/'D.1 Prod + AH + Verbrauch'!C46","v":2.3976304442056812E-2}]
[2019,7.2429463842342501E-2,20709804,3.7648312499749599E-2,10983228,1500000,413499.99999999977,1913499.9999999998,1500000,413500,1913500,0.99999999999999989,{"$f":"SUM(C36,E36)/1000000/'D.1 Prod + AH + Verbrauch'!C47","v":3.1681911649011192E-2}]
[2020,9.0000000000000011E-2,18189815,0.05,6794723,1637083.35,339736.15,1976819.5,1500000,507499.99999999994,2007499.9999999998,0.98471706102117074,{"$f":"SUM(C37,E37)/1000000/'D.1 Prod + AH + Verbrauch'!C48","v":2.3487602622086511E-2}]
["(1) 2021",5.3952260234626903E-2,27802357,3.9751758220266102E-2,12578060,1500000.0000000009,500000.00000000023,2000000.0000000012,1500000,500000,2000000,1.0000000000000007,{"$f":"SUM(C38,E38)/1000000/'D.1 Prod + AH + Verbrauch'!C49","v":3.5254916255159759E-2}]
["(1) 2022",3.4343533881865201E-2,43676344,4.1531247113578328E-2,12039128,1500000,500000,2000000,1500000,500000,2000000,1,{"$f":"SUM(C39,E39)/1000000/'D.1 Prod + AH + Verbrauch'!C50","v":4.9099985459160098E-2}]

{"sheet":"D.4 PP","index":20,"n_rows":36,"n_cols":20,"rows_kept":36,"cut":false,"hidden":false,"merged":[]}
[null,null,null,null,null,null,{"$f":"Codierung!I184","v":"Eidgenössisches Departement für  Wirtschaft, Bildung und Forschung WBF"}]
[null,null,null,null,null,null,{"$f":"Codierung!I185","v":"Bundesamt für Landwirtschaft BLW"}]
[null,null,null,null,null,null,{"$f":"Codierung!I186","v":"Fachbereich Marktanalysen"}]
[]
[]
[{"$f":"Codierung!I175","v":"Produzenten- und Importpreise"}]
[{"$f":"Codierung!I217","v":"in CHF / Ei"}]
[{"$f":"Codierung!$I$206","v":"Quellen: BLW, Fachbereich Marktanalysen; EZV"}]
[{"$f":"Codierung!I215","v":"Publikationsrecht: Weiterverarbeitung und Publikation unter Quellenangabe gestattet."}]
[]
[{"$f":"Codierung!$I$154","v":"Zurück zum Inhaltsverzeichnis"}]
[{"$f":"Codierung!$I$253","v":"Informationen zur Methodik"}]
[null,{"$f":"Codierung!$I$9","v":"Bio"},null,null,null,null,{"$f":"Codierung!$I$10","v":"Bodenhaltung"},null,null,null,null,{"$f":"Codierung!$I$11","v":"Freilandhaltung"},null,null,null,null,{"$f":"Codierung!$I$66","v":"CH gesamt"},{"$f":"Codierung!$I$67","v":"Verarbeitungseier Import"},{"$f":"Codierung!$I$68","v":"Konsumeier Import"},{"$f":"Codierung!$I$69","v":"CH und Import"}]
[null,"< 50 g","50 - 53 g","> 53 g",{"$f":"Codierung!$I$65","v":"2. Klasse"},{"$f":"Codierung!$I$64","v":"Gewichteter Mittelwert"},"< 50 g","50 - 53 g","> 53 g",{"$f":"Codierung!$I$65","v":"2. Klasse"},{"$f":"Codierung!$I$64","v":"Gewichteter Mittelwert"},"< 50 g","50 - 53 g","> 53 g",{"$f":"Codierung!$I$65","v":"2. Klasse"},{"$f":"Codierung!$I$64","v":"Gewichteter Mittelwert"}]
[2001,"-","-","-",0.33155355469700243,0.39281263871292799,"-","-","-",6.3594842793324335E-2,0.22731676588363756,"-","-","-",6.2014041103391482E-2,0.25573316802406371,0.2530305028202951,0.10531120035538027,0.14628991391924298,0.2044001322550528]
[2002,"-","-","-",0.23110031995235478,0.38986477723367413,"-","-","-",7.0674655914683762E-2,0.23051190766906848,"-","-","-",5.9803539809113584E-2,0.25532976137250157,0.25671346648042581,0.11259858527880771,0.14237433841160491,0.20630859382912603]
[2003,"-","-","-",0.20947567816355248,0.39154517948472051,"-","-","-",0.10275854868740952,0.22736041963389267,"-","-","-",7.67429776683521E-2,0.25115650226765751,0.25519680290174646,0.12047642156329803,0.15289460114783043,0.2097185181853895]
[2004,"-","-","-",0.11072811637767985,0.40541645367865092,"-","-","-",8.9190823562908805E-2,0.22483751407977004,"-","-","-",6.5437430432344651E-2,0.2500051808379401,0.26098873854552157,0.11524400067405066,0.15044971962652523,0.20687965138756897]
[2005,"-","-","-",0.1208986999832608,0.40165632460317141,"-","-","-",9.2206371554698421E-2,0.22416045386798608,"-","-","-",6.7719658373782327E-2,0.24225023847721619,0.26204176158336451,0.10395197557856793,0.14422842235468189,0.20250138628539455]
[2006,"-","-","-",0.11748828990276873,0.39342189630094243,"-","-","-",0.10726742371595591,0.22095374825056982,"-","-","-",7.6554688652988784E-2,0.23461579364018093,0.25606500615617073,9.9043781923453034E-2,0.14350523139492327,0.19719049258277288]
[2007,"-","-","-",0.14526618463704688,0.39413733893848174,"-","-","-",0.12092309584235365,0.21845439181423537,"-","-","-",7.4044943124143531E-2,0.22582134587643307,0.25105146240468174,0.11803571022635823,0.15314560669033528,0.19973638970714511]
[2008,"-","-","-",0.15768788443816517,0.39994607999528226,"-","-","-",0.12229449700261451,0.2274750591074691,"-","-","-",9.4970152618997744E-2,0.23475145775372255,0.25855357075906793,0.12715923835582704,0.17093965565557123,0.2107165291122049]
[2009,"-","-","-",0.1491776114099474,0.40613365514664274,"-","-","-",0.1272993477260379,0.22841062262430342,"-","-","-",9.3161697133717941E-2,0.23636951998692801,0.26255599301875487,0.13323279968040855,0.1762053141842258,0.21593409427596608]
[2010,"-","-","-",0.15272377354075875,0.39643945822049925,"-","-","-",0.12543149575240789,0.21994480627434007,"-","-","-",0.10451597153202799,0.23057874976350065,0.25584331172719638,0.12286595706870815,0.16094289471761825,0.2074395078607123]
[2011,"-","-","-",0.16761787001748182,0.39888282606380954,"-","-","-",0.10080939098448392,0.21692883147067796,"-","-","-",0.10911607195536004,0.23021485542164846,0.25743455489391504,0.10323805454678481,0.14132672934036247,0.20175882362160991]
[2012,"-","-","-",0.16309972409096546,0.39996015236713006,"-","-","-",9.9134769338674197E-2,0.21695993334017358,"-","-","-",0.10188930074338438,0.23025482148664397,0.26007843342941489,0.11904158121022056,0.15253739486976101,0.20981402422771472]
[2013,"-","-","-",0.13584737194584692,0.41647088078973588,"-","-","-",9.8660702074826911E-2,0.22367764456543957,"-","-","-",8.8879037629783747E-2,0.2379876342820417,0.27281616178922707,0.12006881096748775,0.15690331992622031,0.21966949170084568]
[2014,"-","-","-",0.13974485369036263,0.42381712654804532,"-","-","-",0.11176169092701051,0.2259426282788479,"-","-","-",9.499479179115837E-2,0.24076186798573301,0.2763020124424152,0.10406259386133493,0.14517003894723043,0.219729484630132]
[2015,0.10151636570224304,0.19386691701088998,0.45304694512700033,0.11234485845593083,0.42175754632867951,4.5582509468980709E-2,0.1431817310221668,0.23928615290425784,3.5583900565703118E-2,0.22109599217153575,5.1703366574972667E-2,0.14538159086260219,0.2487126304627259,6.6760028970895127E-2,0.23209780224595694,0.27518446741173735,0.10084748080979346,0.13490870276994665,0.22055082917457269]
[2016,0.10158227776337343,0.18982450031740042,0.45386595871920637,0.11299907491865582,0.42254545141471328,4.5420353359735835E-2,0.14550797542946695,0.23660415324856648,3.3056221037315779E-2,0.21688131642460717,5.1005623665209207E-2,0.13594222679709381,0.24158177940676079,6.2991594947651219E-2,0.22148017906082651,0.26715333236733807,0.11177880365147591,0.14069823978296148,0.22033540515969871]
[2017,0.10171219317095748,0.19000688715069133,0.45400574986349213,0.11254573682693944,0.42117366062449513,4.6682812444508254E-2,0.14843603259281846,0.23646777102459851,3.2892365034870814E-2,0.21692929387211307,5.1320857493016847E-2,0.13822225423978388,0.242079327705123,6.2282984667370971E-2,0.22231503454621834,0.2681036386984314,0.11848620940691076,0.13605416312106369,0.22122813342818209]
[2018,0.10183459029945724,0.18874022760793011,0.45828614728021538,0.1138578426232866,0.42467865217413875,4.8022667381158929E-2,0.14908723657289899,0.23720502819983638,3.4917376659438934E-2,0.21678669669732056,5.0295853260332681E-2,0.14280288807058131,0.24224645418035001,5.8951864838473651E-2,0.22412229101157119,0.2700255859330456,0.11924933720891862,0.13828875811805053,0.22527946704572854]
[2019,0.1027614589187183,0.19364713852861473,0.46670251489144787,0.11371075332739343,0.43283569746931722,5.0820992600156704E-2,0.15022267019975802,0.23767033513678609,3.6056908060747725E-2,0.21574359666014356,4.7437895266204164E-2,0.14007720920504602,0.24455783662261343,5.4925474470484112E-2,0.22689373936673216,0.27451807059429056,0.11560335123013425,0.13594574617148464,0.2281559044940179]
[2020,0.10544586804084895,0.19541479111828747,0.46949509638959863,0.11408540993343423,0.43572780170384373,4.9589738194404188E-2,0.14970340752291725,0.23468108733496537,3.6577474735199789E-2,0.21319386323385217,5.147009459591436E-2,0.14521362538573174,0.24414379844913248,5.2204035231002761E-2,0.22580261615006481,0.27324611938555177,0.11615936898799993,0.13332513889516015,0.22792651966432842]
[2021,0.10675860864990142,0.19444717782532911,0.46891313997002537,9.0332062700551247E-2,0.43120707824739313,5.0263017106113618E-2,0.15091183718344936,0.23082338995512625,3.7411918145604579E-2,0.20593634293521643,4.9998696371793154E-2,0.14785317576515092,0.24089181355132211,5.0124534159388397E-2,0.22067574612839355,0.26754793682574785,0.11862647527006649,0.1385772466167649,0.22639660446759069]
[2022,0.10756761020879257,0.19889567100085082,0.47848929376908222,0.10573558784820841,0.44189808082591542,5.2924022679087336E-2,0.15237198872079927,0.23482600173222082,3.789781167067105E-2,0.21129116467928008,4.9693662091601483E-2,0.14825459957207138,0.250344336319136,5.2296150166588104E-2,0.22942256586891285,0.28084302187685167,0.14582397760162977,0.15184924283921197,0.2429991563342826]

{"sheet":"D.5 GHP Gastro","index":21,"n_rows":24,"n_cols":11,"rows_kept":24,"cut":false,"hidden":false,"merged":[]}
[null,null,null,null,null,null,null,{"$f":"Codierung!I184","v":"Eidgenössisches Departement für  Wirtschaft, Bildung und Forschung WBF"}]
[null,null,null,null,null,null,null,{"$f":"Codierung!I185","v":"Bundesamt für Landwirtschaft BLW"}]
[null,null,null,null,null,null,null,{"$f":"Codierung!I186","v":"Fachbereich Marktanalysen"}]
[]
[]
[{"$f":"Codierung!I176","v":"Preise im Liefer- und Abholgrosshandel"}]
[{"$f":"Codierung!I217","v":"in CHF / Ei"},null,null,null,null,null,{"$f":"Codierung!I242","v":"Anmerkungen:"}]
[{"$f":"Codierung!$I$207","v":"Quellen: BLW, Fachbereich Marktanalysen; Grossopanel AG, Stans"},null,null,null,null,null,"(1)",{"$f":"Codierung!$I$263","v":"Erweiterung des Datenpanels von Grossopanel"}]
[{"$f":"Codierung!I215","v":"Publikationsrecht: Weiterverarbeitung und Publikation unter Quellenangabe gestattet."}]
[]
[{"$f":"Codierung!$I$154","v":"Zurück zum Inhaltsverzeichnis"}]
[{"$f":"Codierung!$I$253","v":"Informationen zur Methodik"}]
[null,{"$f":"Codierung!$I$78","v":"Eier frisch"},null,null,null,null,{"$f":"Codierung!$I$79","v":"Eier gekocht"}]
[null,{"$f":"Codierung!$I$9","v":"Bio"},{"$f":"Codierung!$I$10","v":"Bodenhaltung"},{"$f":"Codierung!$I$11","v":"Freilandhaltung"},{"$f":"Codierung!$I$81","v":"alle Produktionsformen CH"},{"$f":"Codierung!$I$80","v":"Bodenhaltung Import"},{"$f":"Codierung!$I$9","v":"Bio"},{"$f":"Codierung!$I$10","v":"Bodenhaltung"},{"$f":"Codierung!$I$11","v":"Freilandhaltung"},{"$f":"Codierung!$I$81","v":"alle Produktionsformen CH"},{"$f":"Codierung!$I$80","v":"Bodenhaltung Import"}]
[2013,0.63460454210828277,0.40599011109149397,0.43688420710393983,0.42646154766216732,0.33786929672357568,"-",0.50457478156684554,0.64368091784808357,0.5160292923998494,0.42587467888918779]
[2014,0.59928695338116544,0.40902979487100333,0.4324333041940015,0.42711481493531001,0.33388554912887375,"-",0.50425585904317693,0.63366707756847362,0.51988615399507054,0.42268625311873625]
[2015,0.62710810555807928,0.41758606871230403,0.42306075753166755,0.42617673235680986,0.32224075812760461,"-",0.49295644145250511,0.63104547897467134,0.50934171968218567,0.4145408331081652]
[2016,0.64267274419777798,0.41723132482935904,0.42319040128300844,0.42722284735931387,0.32044513254606893,"-",0.48649034429387561,0.62762563574350705,0.50890172737109285,0.41582514927075531]
[2017,0.6349713599093274,0.40267021920549401,0.42734725682388314,0.42596531204432952,0.31898215725698509,"-",0.47270740311799903,0.57761887134582113,0.50919416417726471,0.416012509926937]
[2018,0.66782637572204273,0.40426196898179606,0.43555485545549411,0.43600628360461013,0.33609821542403795,"-",0.49223907730130445,0.53818048399055007,0.51569908622956484,0.45600201959525016]
[2019,0.7253631687375337,0.39469204554476106,0.56359111303011311,0.50923399694417237,0.33940742715994865,"-",0.4723466215757699,0.62007913104040135,0.57095060079059257,0.48596859046750762]
[2020,0.7138324021886987,0.38470647879240455,0.49403063685183585,0.48351095962927698,0.33626930733306643,"-",0.48189810317215681,0.67645855462316007,0.6296217841392463,0.52214789852927423]
[2021,0.70619076618391441,0.3668494318782432,0.48803750940149526,0.47442242975945814,0.32617657645443277,"-",0.48808033082370555,0.6844503722766101,0.63509751539155834,0.52648521827064232]
[2022,0.72688734731028604,0.38807671637106195,0.49287155224928286,0.47734659579939548,0.35162714277618856,"-",0.50200972534161237,0.67904590908440454,0.63264996438590881,0.52873419283941803]

{"sheet":"D.6 KP","index":22,"n_rows":36,"n_cols":23,"rows_kept":36,"cut":false,"hidden":false,"merged":[]}
[null,null,null,null,null,null,{"$f":"Codierung!I184","v":"Eidgenössisches Departement für  Wirtschaft, Bildung und Forschung WBF"}]
[null,null,null,null,null,null,{"$f":"Codierung!I185","v":"Bundesamt für Landwirtschaft BLW"}]
[null,null,null,null,null,null,{"$f":"Codierung!I186","v":"Fachbereich Marktanalysen"}]
[]
[]
[{"$f":"Codierung!I82","v":"Konsumentenpreise"}]
[{"$f":"Codierung!I217","v":"in CHF / Ei"},null,null,null,null,null,{"$f":"Codierung!$I$242","v":"Anmerkungen:"}]
[{"$f":"Codierung!$I$205","v":"Quellen: BLW, Fachbereich Marktanalysen"},null,null,null,null,null,"(1)",{"$f":"Codierung!$I$257","v":"Ab 2016 wurde die Konsumentenpreiserhebung erweitert. Der Discountmarkt ist nun mit drei Akteuren in der Erhebung vertreten. Dadurch sind die Preise leicht gesunken."}]
[{"$f":"Codierung!I215","v":"Publikationsrecht: Weiterverarbeitung und Publikation unter Quellenangabe gestattet."},null,null,null,null,null,"(2)",{"$f":"Codierung!$I$262","v":"Ab 2019 wurde die Konsumentenpreiserhebung erweitert. Der Verbrauchermarkt ist nun mit zwei Akteuren in der Erhebung vertreten. Die Preise blieben konstant."}]
[]
[{"$f":"Codierung!$I$154","v":"Zurück zum Inhaltsverzeichnis"}]
[{"$f":"Codierung!$I$253","v":"Informationen zur Methodik"}]
[null,{"$f":"Codierung!$I$78","v":"Eier frisch"},null,null,null,null,{"$f":"Codierung!$I$79","v":"Eier gekocht"},null,null,null,null,{"$f":"Codierung!$I$83","v":"4er Packung frisch"},null,null,null,{"$f":"Codierung!$I$84","v":"6er Packung frisch"},null,null,null,{"$f":"Codierung!$I$85","v":"10er Packung frisch"}]
[null,{"$f":"Codierung!$I$9","v":"Bio"},{"$f":"Codierung!$I$10","v":"Bodenhaltung"},{"$f":"Codierung!$I$11","v":"Freilandhaltung"},{"$f":"Codierung!$I$81","v":"alle Produktionsformen CH"},{"$f":"Codierung!$I$80","v":"Bodenhaltung Import"},{"$f":"Codierung!$I$9","v":"Bio"},{"$f":"Codierung!$I$10","v":"Bodenhaltung"},{"$f":"Codierung!$I$11","v":"Freilandhaltung"},{"$f":"Codierung!$I$81","v":"alle Produktionsformen CH"},{"$f":"Codierung!$I$80","v":"Bodenhaltung Import"},{"$f":"Codierung!$I$9","v":"Bio"},{"$f":"Codierung!$I$10","v":"Bodenhaltung"},{"$f":"Codierung!$I$11","v":"Freilandhaltung"},{"$f":"Codierung!$I$81","v":"alle Produktionsformen CH"},{"$f":"Codierung!$I$9","v":"Bio"},{"$f":"Codierung!$I$10","v":"Bodenhaltung"},{"$f":"Codierung!$I$11","v":"Freilandhaltung"},{"$f":"Codierung!$I$81","v":"alle Produktionsformen CH"},{"$f":"Codierung!$I$9","v":"Bio"},{"$f":"Codierung!$I$10","v":"Bodenhaltung"},{"$f":"Codierung!$I$11","v":"Freilandhaltung"},{"$f":"Codierung!$I$81","v":"alle Produktionsformen CH"}]
[2001,0.80412277579272673,0.47350226632884163,0.62133894103177689,0.55855605308232215,0.32274559920976054,0.90855410297025851,0.55858653895342181,0.73226861065109827,0.64741885620028494,0.38201486798544798,0.81057737618220094,0.65629556084832918,0.67125797621710581,0.72849988588969894,0.77696984385327916,0.50382740970927653,0.60948605127228661,0.55367802303545843,"-",0.43983125298437831,0.54832534634139551,0.45490699883813213]
[2002,0.80958403139098545,0.48546368782563276,0.63344773349398587,0.56984693643512607,0.30846297297395281,0.91001238203215051,0.56701521134029997,0.73403745633722095,0.68023612580462589,0.38811167966561672,0.8128754226996241,0.67158465887202157,0.68814636395435091,0.74604359888280991,0.79474553431004302,0.52269398472550399,0.62317755887358461,0.57072568059594675,"-",0.44592278387213707,0.56508297455171808,0.46603810214632652]
[2003,0.80495776960440979,0.47400546495591322,0.61565608206676303,0.56091923506703234,0.3044925818280701,0.93231137898127614,0.56792481937962602,0.76390641388985969,0.67134286805931509,0.42773844972781144,0.8117097160819271,0.62315084578441393,0.66973921926408275,0.72885614133688359,0.80161929519478214,0.50994924767285932,0.59840097059053277,0.56488322560567117,"-",0.44527006398811314,0.5762298862005828,0.46587453116796917]
[2004,0.80007246222355743,0.47326678270794781,0.61055755811120627,0.56937518563263123,0.31694212871289673,0.93835683062297726,0.57532179486790291,0.76415368358713887,0.69022410294138914,0.38315131710640787,0.80973897218865587,0.61168047677501525,0.66249684628704575,0.72314440674203839,0.80101447141418169,0.51161366467851466,0.60822594855573442,0.58456636565251363,"-",0.43802715160378292,0.56437423358016903,0.46797026902891603]
[2005,0.80263657539600075,0.47184250800177951,0.60410087985473515,0.57391099694400727,0.3005679853869469,0.94073735364571265,0.60241362481294514,0.77169045960764349,0.71287531526558523,0.38269719721400025,0.80297439149758121,0.60044071215892036,0.66242089305913554,0.72451321490370446,0.80388122118173966,0.5125026236327328,0.6025806350781201,0.59666337573894745,"-",0.44129133460428355,0.56870985529682039,0.47353807494366851]
[2006,0.80055116592962605,0.4734026422162072,0.60598811999337399,0.57173965420316375,0.31542455638061767,0.93946452879018738,0.60000464279808619,0.7739168064388614,0.71289303204400778,0.33841354039802524,0.80426459220056878,0.61439220811936068,0.6738859485171097,0.72260304445674117,0.80203183391249266,0.50170306485929828,0.60356996882662139,0.58764483334968054,"-",0.4394489598187698,0.55839118214170025,0.46637324800189861]
[2007,0.80614223636922666,0.46803041102425641,0.60751114642667869,0.57129938633496868,0.32153529805969355,0.94087492105682347,0.61123394687973565,0.77900299774244686,0.71873374654228561,0.34871942982221238,0.80908133311851516,0.62105290915118461,0.68008838217538137,0.72677066979063054,0.8059619260433265,0.50020827509012045,0.60176701189544635,0.5896073133943649,"-",0.42902778045368661,0.55930012951215358,0.46391692342420376]
[2008,0.83542711433139305,0.48372787253486388,0.62419645384470956,0.5905621329141657,0.3544003048320431,0.96836873398485324,0.63680000660287428,0.81580002544381869,0.73117978526662408,0.3531216449377888,0.85927278406020757,0.63800175996794639,0.70543925378405337,0.76211790344979191,0.81673140603268246,0.52076760063202687,0.62740939746154833,0.61320736500209305,"-",0.44111163313771612,0.5616945515031555,0.47673468039743006]
[2009,0.84161595034436498,0.49142781332047919,0.64190702478209749,0.60742252279623676,0.31766511407574322,0.96441671887890135,0.65673892137846923,0.83214825222929956,0.75313156262613146,0.36213415387438658,0.85470301197445142,0.63419948725875452,0.72828848182054751,0.77383836820690077,0.82918595871804435,0.52608501536474195,0.64187971686301215,0.62407746938532482,"-",0.45725609800515027,0.58325758743045197,0.49633844937863147]
[2010,0.81131328137651437,0.48094078120422973,0.63370442626344547,0.59899777587680014,0.31495183679724897,0.94141762692936881,0.638948767584538,0.81571275507911212,0.72942882034909362,0.33366765568217283,0.82416238036459544,0.63191243236975125,0.70448730764364531,0.74674364708394114,0.8037045153419049,0.51632187538344676,0.63614401970716128,0.62088082844652059,"-",0.44878921452730097,0.56553413178963896,0.49480593413733626]
[2011,0.7980544354837541,0.45652657739497066,0.62134383144391336,0.58425689287043636,0.30510251909756564,0.91145765008389401,0.60739415674128194,0.81273977311565471,0.71006637450524424,0.3398061748786087,0.8082988880537747,0.62713291665958104,0.68516318212457128,0.73926702562836055,0.79049195439295461,0.50140673088380627,0.62658521281544655,0.61042400983628242,0.77999999999999992,0.42310193109570376,0.57286334176519182,0.47727111183351767]
[2012,0.79936890581718612,0.44788945327677515,0.61104125577986279,0.58355615421496454,0.29749497474174846,0.90881053100011644,0.58800005859856086,0.80887838566474557,0.70724948703422852,0.34964924991190433,0.81546398095582884,0.62563813666303092,0.67747666335646195,0.73704016876801892,0.79276857556762459,0.48677679721056094,0.61375694009877269,0.60959076883733243,0.76721311475409848,0.37965899747155007,0.550506400533323,0.43776564228430032]
[2013,0.81133382153283506,0.45047593645971717,0.61772364397855173,0.59850232265020331,0.30152866202083095,0.94229650625148031,0.60232485261114821,0.82645353429017088,0.72834460283233904,0.33871489559202822,0.84009161163941126,0.64124040646823799,0.69516118469448129,0.76179573368795683,0.80058613660605704,0.48915479987358967,0.62643820912518788,0.63092201513960744,0.71362255455057344,0.4162167219733276,0.57383263958168218,0.47750613959205723]
[2014,0.82118597276938565,0.45128130343756651,0.6323749758882381,0.6044193667446649,0.28893147245662004,0.93693555993743638,0.59865081651972152,0.8374337385375451,0.74231858519443439,0.32001715379289158,0.8554429373460507,0.63223925956345672,0.71156830311020025,0.77145737443420126,0.81077484705397296,0.48892865471048291,0.63585930156962966,0.63390830678343113,0.77578965810192491,0.42681367333344272,0.58038112647578433,0.49913560932158008]
[2015,0.81076603678749426,0.44301147376836575,0.62632466629085293,0.60615100622462237,0.27447574695422988,0.9592780827814863,0.59444580308614059,0.81378893692184628,0.73986428016624017,0.327715028232269,0.83899614756346175,0.6242055381557402,0.70734904208958316,0.76451242341652781,0.81209207782556381,0.48585810121207101,0.6261637729469518,0.63529624681252772,0.75680003163320186,0.41526960606426266,0.58854380938734141,0.50729530806658096]
[2016,0.80782067459878037,0.43393183223943699,0.61292171591701039,0.59397855187721516,0.24927019113290425,0.96687373280680999,0.60008794802044274,0.79154555067700005,0.72487880004328364,0.31607465202866397,0.84926126284868442,0.61372033121359681,0.69955472069238411,0.77006210532617558,0.79770647307240294,0.4877822648839743,0.6200618089301777,0.6316939039501932,0.76622215742698641,0.39222668207388323,0.58598109148691646,0.46541766703413123]
[2017,0.80581205970155534,0.42638591477787319,0.61448209339431503,0.59765434734689815,0.24738713327913936,0.96442240454088368,0.60389033361263222,0.80122793802197689,0.73655570903140311,0.31392703657051696,0.84123211904355022,0.61039778669604494,0.69380214366857396,0.76078704328611679,0.80193029090872159,0.48326840064188281,0.62106159140403883,0.63459829966107373,0.77350495482045933,0.38190932837118341,0.59238857911365062,0.4749783569650326]
[2018,0.81321101768378079,0.42825592528964523,0.6146736858391797,0.59809236663167509,0.24238452000403488,0.9464284373104126,0.59810295893323007,0.78486769155811087,0.74380390092137949,0.33304981466935907,0.84554301631231454,0.62684535042246936,0.69875697961183769,0.768673136303893,0.81821993578286856,0.49273279410040571,0.62675042134326686,0.64384942450324956,0.75881656846796741,0.37609128632370081,0.58064208690863151,0.46429908811081577]
[2019,0.81803811673348992,0.41908813321103028,0.59627506375109907,0.60420649524597425,0.23540778075785354,0.96142710454580571,0.6071066792818014,0.74189947673599255,0.74235356508037742,0.30215278091625031,0.85148123074855664,0.628279699889294,0.68483504361171865,0.76350944087759554,0.82217159900119263,0.50246051875603703,0.61551201346196227,0.65430891499711197,0.77863170799694725,0.36699854854632002,0.56121050207632173,0.47892428366644574]
[2020,0.82228186132610026,0.42286811996385271,0.58520227285263038,0.60613936633813537,0.22978805489340132,0.94774866105086419,0.60160945523019005,0.70712577334442883,0.72725008164267402,0.3058382134278802,0.85338539538459934,0.55020357149292476,0.68129715501571797,0.75337621498505647,0.83240602698478461,0.52900910028337533,0.60596307590481324,0.66341865640050479,0.77996042547783795,0.3633338576883044,0.54530757876101954,0.49253841844395668]
[2021,0.82412455607059854,0.42078150366278783,0.58378090061973675,0.61051939627057727,0.21823160362189958,0.95092649216856995,0.60336063359871217,0.69359877460749231,0.71649564325759219,0.30783442617684581,0.84774692315862421,0.49556178397700107,0.69306554768559026,0.75355818713067135,0.83602415393860707,0.54413561604708671,0.6042637980308867,0.67663412252179977,0.77925418145358427,0.35736355857643853,0.54408764032390033,0.5159619023902946]
[2022,0.83080605128283047,0.39322394617955592,0.58112895314586355,0.61819541377032405,0.22671404758347313,0.92298616533062283,0.59372357267885534,0.67286087076475243,0.69553904553972234,0.31215988915465803,0.86798694849909974,0.53918899395164144,0.70969804983031681,0.78840541307409462,0.84922813388603458,0.55489653853562537,0.61691587034182915,0.69749597958848786,0.77416852733483754,0.36473201923549003,0.55403333366100782,0.53151006001680168]

{"sheet":"D.7 MS","index":23,"n_rows":39,"n_cols":32,"rows_kept":39,"cut":false,"hidden":false,"merged":[]}
[null,null,null,null,null,null,null,{"$f":"Codierung!I184","v":"Eidgenössisches Departement für  Wirtschaft, Bildung und Forschung WBF"}]
[null,null,null,null,null,null,null,{"$f":"Codierung!I185","v":"Bundesamt für Landwirtschaft BLW"}]
[null,null,null,null,null,null,null,{"$f":"Codierung!I186","v":"Fachbereich Marktanalysen"}]
[]
[]
[{"$f":"Codierung!$I$177","v":"Marktstruktur"},null,null,null,null,null,null,{"$f":"Codierung!I242","v":"Anmerkungen:"}]
[{"$f":"Codierung!I224","v":"in %"},null,null,null,null,null,null,"(1)",{"$f":"Codierung!I248","v":"Erweiterung der Datenerhebungen bei den Sammelstellen"}]
[{"$f":"Codierung!$I$222","v":"in Mio. Stück"},null,null,null,null,null,null,"(2)",{"$f":"Codierung!I255","v":"Verarbeitungseier (oft aus Bodenhaltung) direkt für die Industrie werden in der Erhebung Sammelstellen tendenziell unterproportional einbezogen"}]
[{"$f":"Codierung!$I$211","v":"Quellen: BLW, Fachbereich Marktanalysen; Aviforum; NielsenIQ Switzerland, Total Market Consumer/Retail Panel; Grossopanel AG, Stans"},null,null,null,null,null,null,"(3)",{"$f":"Codierung!$I$90","v":"Anteile anhand des linearen Angebots im Verkaufsregal. Die Anteile zeigen nicht die effektiven Absatzanteile (z.B. Importeier werden überschätzt). Effektive Absatzanteile lassen sich mit Absatzzahlen von NielsenIQ Switzerland berechnen."}]
[{"$f":"Codierung!I215","v":"Publikationsrecht: Weiterverarbeitung und Publikation unter Quellenangabe gestattet."},null,null,null,null,null,null,"(4)",{"$f":"Codierung!$I$100","v":"Absätze anhand NielsenIQ Switzerland, Total Market Consumer/Retail Panel; Kalkulation Fachbereich Marktanalysen BLW"}]
[null,null,null,null,null,null,null,"(5)",{"$f":"Codierung!$I$251","v":"Umrechnungsfaktoren: Eiprodukte getrocknet 80 Eier / kg; Eiprodukte flüssig 20.58 Eier / kg; Schaleneier 16.6 Eier / kg"}]
[{"$f":"Codierung!$I$154","v":"Zurück zum Inhaltsverzeichnis"},null,null,null,null,null,null,"(6)",{"$f":"Codierung!$I$262","v":"Ab 2019 wurde die Konsumentenpreiserhebung erweitert. Der Verbrauchermarkt ist nun mit zwei Akteuren in der Erhebung vertreten. Die Preise blieben konstant."}]
[]
[null,{"$f":"Codierung!$I$70","v":"Produktion Inland"},null,null,null,null,null,{"$f":"Codierung!$I$86","v":"Liefer- und Abholgrosshandel"},null,null,null,null,null,null,null,null,null,null,null,null,null,{"$f":"Codierung!$I$88","v":"Detailhandel (3)"},null,null,null,null,null,{"$f":"Codierung!$I$89","v":"Detailhandel (4)"}]
[null,{"$f":"Codierung!$I$91","v":"Erhebung Sammelstellen"},null,null,null,{"$f":"Codierung!$I$92","v":"Produktion Total (aus Kükenstatistik)"},null,{"$f":"Codierung!$I$28","v":"Schaleneier"},null,null,null,null,null,{"$f":"Codierung!$I$29","v":"Eiprodukte (5)"},null,null,{"$f":"Codierung!$I$36","v":"Total"},null,null,null,null,{"$f":"Codierung!$I$28","v":"Schaleneier"},null,null,null,null,null,{"$f":"Codierung!$I$28","v":"Schaleneier"}]
[null,{"$f":"Codierung!I224","v":"in %"},null,null,null,{"$f":"Codierung!I224","v":"in %"},null,{"$f":"Codierung!I224","v":"in %"},null,null,null,null,null,{"$f":"Codierung!I224","v":"in %"},null,null,{"$f":"Codierung!I224","v":"in %"},null,null,null,null,{"$f":"Codierung!I224","v":"in %"},null,null,null,null,null,{"$f":"Codierung!$I$222","v":"in Mio. Stück"}]
[null,{"$f":"Codierung!$I$9","v":"Bio"},{"$f":"Codierung!$I$10","v":"Bodenhaltung"},{"$f":"Codierung!$I$11","v":"Freilandhaltung"},{"$f":"Codierung!$I$93","v":"Abdeckung durch Erhebung (2)"},{"$f":"Codierung!$I$9","v":"Bio"},{"$f":"Codierung!$I$94","v":"Boden- und Freilandhaltung"},{"$f":"Codierung!$I$9","v":"Bio"},{"$f":"Codierung!$I$10","v":"Bodenhaltung"},{"$f":"Codierung!$I$11","v":"Freilandhaltung"},{"$f":"Codierung!$I$98","v":"Anteil Inland"},{"$f":"Codierung!$I$99","v":"Anteil Import"},{"$f":"Codierung!$I$95","v":"ohne Angabe"},{"$f":"Codierung!$I$98","v":"Anteil Inland"},{"$f":"Codierung!$I$99","v":"Anteil Import"},{"$f":"Codierung!$I$95","v":"ohne Angabe"},{"$f":"Codierung!$I$98","v":"Anteil Inland"},{"$f":"Codierung!$I$99","v":"Anteil Import"},{"$f":"Codierung!$I$95","v":"ohne Angabe"},{"$f":"Codierung!$I$28","v":"Schaleneier"},{"$f":"Codierung!$I$29","v":"Eiprodukte (5)"},{"$f":"Codierung!$I$9","v":"Bio"},{"$f":"Codierung!$I$10","v":"Bodenhaltung"},{"$f":"Codierung!$I$11","v":"Freilandhaltung"},{"$f":"Codierung!$I$45","v":"Import"},{"$f":"Codierung!$I$98","v":"Anteil Inland"},{"$f":"Codierung!$I$99","v":"Anteil Import"},{"$f":"Codierung!$I$36","v":"Total"},{"$f":"Codierung!$I$9","v":"Bio"},{"$f":"Codierung!$I$10","v":"Bodenhaltung"},{"$f":"Codierung!$I$11","v":"Freilandhaltung"},{"$f":"Codierung!$I$45","v":"Import"}]
[2001,0.12093353534101248,0.43350487590262399,0.44556158875636359,0.35766254138083242,null,null,null,null,null,null,null,null,null,null,null,null,null,null,null,null,9.6732495993699749E-2,0.52483324079997429,0.32511812806669044,0.17390519714792546,0.82609480285207448,0.17390519714792546]
[2002,0.12344175163682546,0.41534266478068549,0.46121558358248904,0.38754344148099851,null,null,null,null,null,null,null,null,null,null,null,null,null,null,null,null,0.11116766498317388,0.5114248289211264,0.31871579423049345,0.20630884525366741,0.79369115474633245,0.20630884525366741]
[2003,0.12960046743918238,0.42497544807664417,0.44542408448417348,0.45491270366079811,null,null,null,null,null,null,null,null,null,null,null,null,null,null,null,null,0.11992230529074407,0.51425406451629341,0.30750650138988167,0.19928423249579066,0.80071576750420903,0.19928423249579066]
[2004,0.15410007459960351,0.3916180508745884,0.45428187452580809,0.49568752796028159,null,null,null,null,null,null,null,null,null,null,null,null,null,null,null,null,0.15247837899716937,0.49222983828661959,0.32275574934723633,0.20544021525056341,0.79455978474943667,0.20544021525056341]
[2005,0.15571976453309447,0.39813671997452754,0.44614351549237807,0.52621853085896297,null,null,null,null,null,null,null,null,null,null,null,null,null,null,null,null,0.17985394597236706,0.48472827068264357,0.31051583095053509,0.209322778492877,0.79067722150712305,0.209322778492877]
[2006,0.15994005332076006,0.35098564660920772,0.48907430007003216,0.49814911209573604,null,null,null,null,null,null,null,null,null,null,null,null,null,null,null,null,0.17863363425892062,0.50367287262104665,0.30311835712308721,0.19495367968042962,0.80504632031957013,0.19495367968042962]
[2007,0.16503072962401275,0.31902824155518583,0.5159410288208014,0.49928367725749218,null,null,null,null,null,null,null,null,null,null,null,null,null,null,null,null,0.17174688023968954,0.50338388365556308,0.31953240422025109,0.19968366746367283,0.80031633253632739,0.19968366746367283]
[2008,0.17616616461880483,0.27388457589636833,0.54994925948482676,0.51081837449850442,null,null,null,null,null,null,null,null,null,null,null,null,null,null,null,null,0.16654152437291403,0.5057173671067684,0.32315154390045336,0.18024364268322174,0.81975635731677843,0.18024364268322174]
[2009,0.18720425305209251,0.261913025850042,0.55088272109786551,0.51325471686448809,null,null,null,null,null,null,null,null,null,null,null,null,null,null,null,null,0.17711204268715813,0.48322297389148439,0.33493722611309412,0.23350670792234965,0.76649329207765027,0.23350670792234965]
[2010,0.18469552466779363,0.2490178896419418,0.56628658569026458,0.52909579548477137,null,null,null,null,null,null,null,null,null,null,null,null,null,null,null,null,0.18277066272167197,0.47190981367756746,0.34296723012033531,0.23470301875138877,0.76529698124861134,0.23470301875138877]
[2011,0.20160347504304763,0.25191820399823422,0.54647832095871818,0.54711135155972501,null,null,null,null,null,null,null,null,null,null,null,null,null,null,null,null,0.19863580816702561,0.47206827549383595,0.32866859958869638,0.21675963763419032,0.78324036236580941,0.21675963763419032]
[2012,0.20854012560994636,0.24121970470315282,0.55024016968690082,0.54924400610374291,0.13764253388935996,0.86235746611064001,null,null,null,null,null,null,null,null,null,null,null,null,null,null,0.21045497236288696,0.44062768962070303,0.34649913848255059,0.23800646321997926,0.76199353678002091,0.23800646321997926]
[2013,0.22357955696229317,0.25026605699614773,0.52615438604155917,0.50746275152365827,0.14287666678979036,0.85712333321020973,7.4025237506696422E-3,0.80620190404900893,0.18639557220032138,0.42741374721358882,0.57083383527953735,1.7524175068738949E-3,3.7868800001928653E-2,0.76777166091389171,0.19435953908417966,0.23962523890430804,0.66577194388617777,9.4602817209514106E-2,0.51792852236061626,0.48207147763938368,0.22879734465552873,0.41927112202279992,0.35035221406789224,0.2233363398693422,0.77666366013065735,0.2233363398693422]
[2014,0.23959938617579982,0.24378154049975684,0.51661907332444323,0.49247764920902537,0.14868401719683055,0.85131598280316945,1.1707464288702006E-2,0.79505375851804705,0.193238777193251,0.43591420547675325,0.56251670585959013,1.5690886636566296E-3,4.5568294126253933E-2,0.85397678636855479,0.10045491950519139,0.24326145221445186,0.70636498335745634,5.0373564428091988E-2,0.50645633101222698,0.49354366898777308,0.22769531280275743,0.41531191608306256,0.35559698013017083,0.23237951563128384,0.76762048436871644,0.23237951563128384]
[2015,0.21828889099348894,0.25296986987632614,0.52874123913018489,0.54521528215490411,0.15307063829404235,0.84692936170595767,1.075035120663397E-2,0.75382122733190338,0.23542842146146264,0.48279485165567637,0.51594778745622183,1.2573608881018428E-3,4.8234347223305857E-2,0.84472751028785675,0.1070381424888374,0.2616620193368272,0.68325243336216457,5.5085547301008203E-2,0.49113453693244352,0.50886546306755653,0.2497966196282819,0.39028390277162334,0.35945697408695443,0.23747309330060862,0.76252690669939149,0.23747309330060862,722.70268685999997,95.015616299999991,273.69575442000001,178.48891763999998,175.5023985]
[2016,0.20833353701629945,0.19410404169172951,0.59756242129197101,0.62874536514127388,0.15709325309284741,0.8429067469071525,1.1527086097262534E-2,0.7404967294822149,0.24797618442052261,0.47837151571093095,0.52070704875047424,9.214355385947753E-4,7.3024644886229881E-2,0.63691618003984996,0.29005917507392015,0.27970488669800359,0.57766290072685544,0.142632212575141,0.5098848830170345,0.49011511698296556,0.23635792927806273,0.40232080475964527,0.36132126596229197,0.28034404475039648,0.71965595524960324,0.28034404475039648,744.868157,101.12019600000001,270.492141,189.24421799999999,184.01160200000001]
[2017,0.22005832999118616,0.17445078004203851,0.60549088996677536,0.6360818874053501,0.16852182958595743,0.83147817041404259,1.1721185447361025E-2,0.67289785932081836,0.31538095523182053,0.51378444122240352,0.48621555877759642,0,0.1187390174175811,0.56649093379444315,0.31477004878797571,0.31782654616839001,0.52603526700625003,0.15613818682535996,0.50396110612629397,0.49603889387370603,0.24031584560601738,0.37140197623257104,0.38828217816141164,0.27582698820864093,0.72417301179135929,0.27582698820864093,755.5347395,109.4721031,267.05880219999995,201.50552350000001,177.49831069999999]
[2018,0.22527450692571116,0.15661602564746399,0.61810946742682482,0.63000261720410955,0.17333533287179531,0.82666466712820463,1.6522078241316452E-2,0.61885807740269339,0.35883113605338024,0.55395836309547952,0.44590657281609597,1.3506408842464383E-4,0.18255351118136923,0.46934741622109516,0.34809907259753559,0.36519864006881536,0.45763744132051787,0.17716391861066677,0.49955433335986088,0.50044566664013912,0.24217060508244634,0.36337347735001596,0.39445591756753773,0.2988710863583926,0.70112891364160768,0.2988710863583926,785.61434991200588,138.06143269999998,259.22066329879181,195.27843851321407,193.05381539999996]
[2019,0.23430242160886788,0.14354787554660589,0.62214970284452609,0.63929705073519183,0.17749869795701689,0.82250130204298311,2.4473219984453863E-2,0.72747400192768086,0.24770712141716664,0.40920752960367113,0.58896340083439258,1.8290695619362753E-3,0.19840746203795798,0.45255744146994004,0.34903509649210218,0.28458854341986684,0.50832408908403837,0.20708736749609494,0.4088285282690598,0.5911714717309402,0.24684002422487542,0.28792337316947564,0.46523660260564886,0.30854317160959216,0.69145682839040779,0.30854317160959216,815.01391953209145,144.62849199999999,217.52671359327925,246.57364033881223,206.2850736]
[2020,0.24755735314718222,0.12242812025930798,0.63001452659350976,0.62958736449842068,0.18547041409827472,0.81452958590172519,2.8781694406402838E-2,0.59874778556405139,0.37239816938818004,0.50829145964889666,0.49029777900248045,1.4107613486230369E-3,0.26116450723112905,0.46365584328809301,0.27517964948077783,0.37749771717926295,0.4761973401607088,0.14630494266002811,0.47074270454916983,0.52925729545083011,0.24013733862303516,0.23534223828978987,0.52452042308717461,0.33479196971938718,0.66520803028061271,0.33479196971938718,947.59644405867175,163.06034990000001,227.26679624905128,288.2178194096204,269.05147849999992]
[2021,0.26910963606773874,0.10290088397274945,0.62798947995951182,0.61835583524826465,0.19080675127293545,0.80919324872706455,3.2512926554960166E-2,0.59918789885210133,0.36829917459293848,0.5193037043423322,0.47860535874651622,2.0909369111515967E-3,0.2795828508480081,0.45808178078664069,0.26233536836535121,0.3835173925090829,0.46698008328060997,0.14950252421030702,0.43356487408608246,0.56643512591391743,0.23718641973012672,0.20780910657110607,0.55500447369876682,0.33168442550342048,0.6683155744965793,0.33168442550342048,907.41105645610594,158.55124759999998,218.54802449437076,281.13458226173537,249.17720209999996]
[2022,0.25758478080964009,9.226867037339119E-2,0.65014654881696865,0.60027734140570299,0.19759062688645398,0.80240937311354599,2.6309195283356387E-2,0.61746175302446815,0.35622905169217556,0.51456617078273992,0.48236284151281178,3.0709877044482912E-3,0.28266234357014097,0.44221957768733555,0.27511807874252359,0.38181799621670037,0.45938372530758598,0.15879827847571368,0.42757229942418301,0.57242770057581693,0.25748943132490687,0.18143901149170344,0.56107155718338964,0.29167445211064275,0.70832554788935698,0.29167445211064275,856.82049562136035,156.29408470000001,201.66253519332966,271.13150932803046,227.7323664000001]

{"sheet":"D.8 BWS","index":24,"n_rows":38,"n_cols":41,"rows_kept":38,"cut":false,"hidden":false,"merged":[[13,1,13,20]]}
[null,null,null,null,null,null,{"$f":"Codierung!I184","v":"Eidgenössisches Departement für  Wirtschaft, Bildung und Forschung WBF"}]
[null,null,null,null,null,null,{"$f":"Codierung!I185","v":"Bundesamt für Landwirtschaft BLW"}]
[null,null,null,null,null,null,{"$f":"Codierung!I186","v":"Fachbereich Marktanalysen"}]
[]
[]
[{"$f":"Codierung!I180","v":"Bruttowertschöpfung"}]
[{"$f":"Codierung!I217","v":"in CHF / Ei"}]
[{"$f":"Codierung!I224","v":"in %"}]
[{"$f":"Codierung!I207","v":"Quellen: BLW, Fachbereich Marktanalysen; Grossopanel AG, Stans"}]
[{"$f":"Codierung!I215","v":"Publikationsrecht: Weiterverarbeitung und Publikation unter Quellenangabe gestattet."}]
[]
[{"$f":"Codierung!$I$154","v":"Zurück zum Inhaltsverzeichnis"}]
[{"$f":"Codierung!$I$253","v":"Informationen zur Methodik"}]
[null,{"$f":"Codierung!$I$14","v":"Verarbeitung und Verteilung"},null,null,null,null,null,null,null,null,null,null,null,null,null,null,null,null,null,null,null,{"$f":"Codierung!$I$15","v":"Verarbeitung für Gastronomie / Ausserhausverpflegung "}]
[null,{"$f":"Codierung!$I$9","v":"Bio"},null,null,null,{"$f":"Codierung!$I$10","v":"Bodenhaltung"},null,null,null,{"$f":"Codierung!$I$11","v":"Freilandhaltung"},null,null,null,{"$f":"Codierung!$I$12","v":"Inland und Import"},null,null,null,{"$f":"Codierung!$I$13","v":"Konsumeier Import"},null,null,null,{"$f":"Codierung!$I$9","v":"Bio"},null,null,null,{"$f":"Codierung!$I$10","v":"Bodenhaltung"},null,null,null,{"$f":"Codierung!$I$11","v":"Freilandhaltung"},null,null,null,{"$f":"Codierung!$I$12","v":"Inland und Import"},null,null,null,{"$f":"Codierung!$I$13","v":"Konsumeier Import"}]
[null,{"$f":"Codierung!$I$2","v":"Einstandspreis "},{"$f":"Codierung!$I$3","v":"Nettoeinnahmen "},{"$f":"Codierung!$I$4","v":"Bruttowertschöpfung"},{"$f":"Codierung!$I$5","v":"Produzentenpreisanteil am Konsumentenfranken"},{"$f":"Codierung!$I$2","v":"Einstandspreis "},{"$f":"Codierung!$I$3","v":"Nettoeinnahmen "},{"$f":"Codierung!$I$4","v":"Bruttowertschöpfung"},{"$f":"Codierung!$I$5","v":"Produzentenpreisanteil am Konsumentenfranken"},{"$f":"Codierung!$I$2","v":"Einstandspreis "},{"$f":"Codierung!$I$3","v":"Nettoeinnahmen "},{"$f":"Codierung!$I$4","v":"Bruttowertschöpfung"},{"$f":"Codierung!$I$5","v":"Produzentenpreisanteil am Konsumentenfranken"},{"$f":"Codierung!$I$2","v":"Einstandspreis "},{"$f":"Codierung!$I$3","v":"Nettoeinnahmen "},{"$f":"Codierung!$I$4","v":"Bruttowertschöpfung"},{"$f":"Codierung!$I$5","v":"Produzentenpreisanteil am Konsumentenfranken"},{"$f":"Codierung!$I$2","v":"Einstandspreis "},{"$f":"Codierung!$I$3","v":"Nettoeinnahmen "},{"$f":"Codierung!$I$4","v":"Bruttowertschöpfung"},{"$f":"Codierung!$I$5","v":"Produzentenpreisanteil am Konsumentenfranken"},{"$f":"Codierung!$I$2","v":"Einstandspreis "},{"$f":"Codierung!$I$3","v":"Nettoeinnahmen "},{"$f":"Codierung!$I$4","v":"Bruttowertschöpfung"},{"$f":"Codierung!$I$6","v":"Produzentenpreisanteil am Gastronomenfranken"},{"$f":"Codierung!$I$2","v":"Einstandspreis "},{"$f":"Codierung!$I$3","v":"Nettoeinnahmen "},{"$f":"Codierung!$I$4","v":"Bruttowertschöpfung"},{"$f":"Codierung!$I$6","v":"Produzentenpreisanteil am Gastronomenfranken"},{"$f":"Codierung!$I$2","v":"Einstandspreis "},{"$f":"Codierung!$I$3","v":"Nettoeinnahmen "},{"$f":"Codierung!$I$4","v":"Bruttowertschöpfung"},{"$f":"Codierung!$I$6","v":"Produzentenpreisanteil am Gastronomenfranken"},{"$f":"Codierung!$I$2","v":"Einstandspreis "},{"$f":"Codierung!$I$3","v":"Nettoeinnahmen "},{"$f":"Codierung!$I$4","v":"Bruttowertschöpfung"},{"$f":"Codierung!$I$6","v":"Produzentenpreisanteil am Gastronomenfranken"},{"$f":"Codierung!$I$2","v":"Einstandspreis "},{"$f":"Codierung!$I$3","v":"Nettoeinnahmen "},{"$f":"Codierung!$I$4","v":"Bruttowertschöpfung"},{"$f":"Codierung!$I$6","v":"Produzentenpreisanteil am Gastronomenfranken"}]
[2001,0.41959676288217396,0.68851755156668981,0.26892078868451602,0.61277660715785764,0.24709767630554128,0.5835462344166652,0.33644855811112384,0.76327122696553118,0.28440339871209191,0.38470588282513168,0.10030248411303976,0.424684013777817,0.21150451025859465,0.47467950425619027,0.26317499399759564,0.44568487032788578,0.15425712695847171,2.8599930111863122E-2,-0.12565719684660859]
[2002,0.41670675103785548,0.86948659004791029,0.45277983901005497,0.47929041740086314,0.25058824839226274,0.52485187916572362,0.27426363077346094,0.4156694966310352,0.28388364161551222,0.68321414096791866,0.39933049935240644,0.47771497159087972,0.20863961287599853,0.47359087246759318,0.2649512595915946,0.44103121837056308,0.14893905879957117,0.34779242360333978,0.1988533648037687,0.42861830951859553]
[2003,0.41454435538905199,0.86048759731056157,0.44594324192150947,0.48182303225839124,0.24803236041977461,0.51441859106000765,0.26638623064023298,0.4216684760814034,0.2812394455410287,0.66796684334057643,0.38672739779954762,0.48258543504193963,0.21091233589039829,0.46445913858951454,0.25354680269911622,0.4548366624148294,0.15941490041461909,0.34474378078570633,0.18532888037108719,0.46326762698491009]
[2004,0.43491776118882913,0.86072130228496391,0.42580354109613489,0.5053536720618611,0.24474013641877324,0.51185365415185924,0.26711351773308606,0.42498926635756035,0.27896420217424561,0.65646790793358922,0.3775037057593435,0.4782026318197854,0.20745599448131991,0.45074985817566998,0.24329386369435016,0.4601293502961849,0.15532672774944964,0.34673339118482255,0.19140666343537294,0.44854223367327212]
[2005,0.42712123174672073,0.85068115679445455,0.42355992504773382,0.50213787651614361,0.23930792113912722,0.51076530011293297,0.2714573789738059,0.41191961958603446,0.26528359213462166,0.64450315190610186,0.37921955977148025,0.46877545387316705,0.19894493604237048,0.44352791006522657,0.24458297402285614,0.44835488706556265,0.14754494479090074,0.32755643576855925,0.18001149097765856,0.45288705549175284]
[2006,0.41333771906213612,0.844182235353229,0.43084451629109283,0.48977858796043522,0.23328353137072202,0.50588999973719695,0.2726064683664749,0.39841540156800498,0.25421919138685567,0.63855957663868568,0.38434038525183006,0.46127159506034227,0.19194216593817401,0.43321716610533589,0.24127500016716197,0.44307030113989959,0.14539969022334534,0.33218449463937144,0.18678480441602605,0.43862956813479809]
[2007,0.41221448054016824,0.83580809551700952,0.42359361497684128,0.49319782477890789,0.22768204824457816,0.5007188750832815,0.27303682683870328,0.3826409745235726,0.24580105119816123,0.6425053311600788,0.39670427996191765,0.45477780391323269,0.19670845253037314,0.42444437497460979,0.2277359224442366,0.46365502848089579,0.15370456008697878,0.33359299736617204,0.17988843727919335,0.46153279990732954]
[2008,0.40894091777213198,0.84932042061259827,0.44037950284046629,0.48166144172738617,0.23166265424802215,0.51461875372203403,0.28295609947401174,0.38144016429511313,0.24851245290850255,0.65237024721976256,0.40385779431126001,0.45036640027745212,0.2020133862924518,0.44205636022167799,0.24004297392922616,0.45736476709362101,0.16775474892604117,0.36039056941407227,0.1926358204880311,0.4660942280251395]
[2009,0.41852686758597013,0.8560305272291221,0.43750365964315185,0.48894388175623343,0.23468752951325345,0.53203235779964586,0.29734482828639247,0.37308940253781203,0.25124318726587946,0.67367865501600821,0.42243546775012875,0.44123736537423169,0.20686273072792602,0.43802388795272912,0.2311611572248031,0.47228540656424828,0.17353984617267507,0.32841292094215274,0.15487307476947768,0.5296053959610848]
[2010,0.40644503367075385,0.81972876327188871,0.41328372960113463,0.49594538181425279,0.22651317711860755,0.51969288075612863,0.29317970363752122,0.36817226817354709,0.24092249655107054,0.65442518668843197,0.41350269013736146,0.43614677489081388,0.19698810878907813,0.42733644091790984,0.23034833212883177,0.46088220528506474,0.15721924515427191,0.3183021482630094,0.16108290310873744,0.49369120027066132]
[2011,0.40754797522149083,0.80198360823986903,0.39443563301837831,0.50823805939438327,0.22560522092800775,0.4943979068058964,0.26879268587788868,0.36839628998212315,0.23804009282002894,0.64617880413864814,0.40813871131861923,0.45634715054257918,0.19156645585094179,0.41489982364270889,0.22333336779176707,0.46198072743122215,0.13762412528829235,0.305135674520083,0.16751154923179071,0.4523106443401223]
[2012,0.41039728484068233,0.81030964831591457,0.39991236347523218,0.5064957268495317,0.2266451910030122,0.48786300047342185,0.26121780947040962,0.36763549659214606,0.23870818396303842,0.64937992546079448,0.41067174149775609,0.46464093993966654,0.20115050369843715,0.42108788437899713,0.21993738068055999,0.4778123253751847,0.14976410492906944,0.30476716240116325,0.1550030574720937,0.49243267007919544]
[2013,0.42359842363909017,0.82490659280619161,0.40130816916710127,0.51353208140003559,0.23315143932987861,0.49938709074641813,0.26623565141653943,0.3745247024078226,0.24627705065850228,0.65772008103080004,0.41144303037229762,0.46692032769143171,0.21177643061505028,0.44377491382920137,0.23199848321415115,0.47716964886470509,0.15450882162159951,0.3038028798397388,0.14929405821813932,0.50896701287996748,0.42359842363909017,0.63122851401078672,0.20763009037169664,0.67201137297592639,0.23315143932987861,0.42607615356714063,0.19292471423726198,0.54770178448760831,0.24627705065850228,0.43739759547462698,0.19112054481612473,0.56358601197111324,0.21177643061505028,0.37633558661822936,0.16455915600317902,0.56268669754366674,0.15450882162159951,0.33354407293622246,0.17903525131462295,0.46318389108850511]
[2014,0.43223267499716944,0.83181513639095339,0.39958246139378395,0.51963093156295381,0.23465176638844976,0.49837654465152587,0.26372477826307622,0.36708854958322218,0.24768761868880815,0.67488110990251993,0.4271934912137117,0.47091006567184368,0.21239020478247247,0.43946277736683698,0.22707257258436453,0.48343001455708628,0.14289932727261748,0.29178895742565181,0.14888963015303433,0.4901294071770565,0.43223267499716944,0.59270085913713111,0.16046818413996178,0.73062739296504586,0.23465176638844976,0.42813972817849244,0.19348796179004271,0.5485612751243979,0.24768761868880815,0.43568449792515701,0.18799687923634878,0.56881367037468322,0.21239020478247247,0.37543621765306279,0.16304601287059034,0.56567147359713343,0.14289932727261748,0.32895933486455742,0.18606000759193989,0.43449491666993328]
[2015,0.43372379801934069,0.83917953736561535,0.40545573934627477,0.51686459237256277,0.22725427947493784,0.49790732136194887,0.27065304188701089,0.35455017657369736,0.23913310672957619,0.67453781421266878,0.43540470748309246,0.4564448405981632,0.21440581140072565,0.45829463252302322,0.24388882112229757,0.46822785505055636,0.13444122472757247,0.28231337748733709,0.14787215275976459,0.4772898987445981,0.43372379801934069,0.62520524484449569,0.19148144682515497,0.69418184346158951,0.22725427947493784,0.43686995342851381,0.2096156739535758,0.52035481550053719,0.23913310672957619,0.43019319024229113,0.19106008351271506,0.55610655852426882,0.21440581140072565,0.37724155571623835,0.16283574431551276,0.56856547964160431,0.13444122472757247,0.32131974419259746,0.18687851946502496,0.41898141369978426]
[2016,0.43747928149418075,0.83756563217272662,0.40008635067854587,0.52232378691774062,0.22382868435075734,0.49176197235454233,0.26793328800378513,0.3526682770408352,0.23094061151000245,0.65496690171613736,0.42402629020613497,0.45525522139194624,0.21539273684470969,0.43942965822896457,0.22403692138425488,0.49015387483109013,0.14065767034274448,0.26111007476501225,0.1204524044222678,0.53870321886825845,0.43747928149418075,0.64304770968675684,0.20556842819257604,0.68065891373395437,0.22382868435075734,0.43788729946017041,0.21405861510941315,0.51131021071475047,0.23094061151000245,0.43396671430280631,0.20302610279280395,0.53236671027425475,0.21539273684470969,0.37809980381399888,0.16270706696928919,0.56977100810423542,0.14065767034274448,0.32098576610905644,0.18032809576631195,0.43851731313005415]
[2017,0.43480761226030856,0.83328137087043608,0.39847375861012763,0.52180503665170586,0.22311812615347323,0.48937014657129768,0.26625202041782431,0.35131729902807313,0.23056134950195439,0.65638871475897631,0.42582736525702192,0.45596337476806742,0.21461577998203787,0.44189381773053449,0.22727803774849656,0.48599022987306234,0.13539369372830665,0.25847811913480234,0.12308442540649563,0.52414063320174764,0.43480761226030856,0.63201743348383743,0.19720982122352901,0.68812314803528718,0.22311812615347323,0.42462542206767334,0.20150729591420011,0.52609813697471952,0.23056134950195439,0.44182581425219242,0.21126446475023811,0.52193363288333516,0.21461577998203787,0.38030729286844284,0.16569151288640491,0.56441605397139261,0.13539369372830665,0.31748133414263346,0.18208764041432679,0.42688019151695339]
[2018,0.43372441965868097,0.82789136283276699,0.39416694317408613,0.52389275624100284,0.22047146781518992,0.47256180256226693,0.25209033474707698,0.34852220736621059,0.2280309652498054,0.65437053890968866,0.4263395736598834,0.46673203077851172,0.21728196755936427,0.44485156095738643,0.2275695933980221,0.48845801823964918,0.13628072238626548,0.25965763578459289,0.1233769133983274,0.52514694218478841,0.43372441965868097,0.65713938655067328,0.22341496689199233,0.66168440931933092,0.22047146781518992,0.42616438064544648,0.20569291283025656,0.51767134960340522,0.2280309652498054,0.44571008726380129,0.21767912201399586,0.51201161311445353,0.21728196755936427,0.39763023629450522,0.1803482687351409,0.54679550682077205,0.13628072238626548,0.33428369289519577,0.19800297050893026,0.40831535688476528]
[2019,0.44003652742327776,0.82838069096933376,0.38834416354605605,0.53121969940870695,0.21840938749634384,0.46493153131118753,0.24652214381484364,0.36591869949612249,0.22999919165065186,0.62863226148905726,0.39863306983840546,0.4700082869775804,0.21798668868907956,0.44329821107233441,0.22531152238325478,0.49216033700576572,0.1336614218114307,0.24960197193837566,0.115940550126945,0.53554184948778294,0.44003652742327776,0.73349017412234119,0.29345364669906332,0.60045317692619737,0.21840938749634384,0.41175090604344428,0.19334151854710038,0.53079532975452171,0.22999919165065186,0.57270471785278632,0.34270552620213451,0.40232373973590946,0.21798668868907956,0.4182159696411259,0.20022928095204637,0.52193252995062034,0.1336614218114307,0.34557548944870903,0.21191406763727835,0.38736896573231161]
[2020,0.44528532379180946,0.83424333361250902,0.3889580098206995,0.53377017066544263,0.21704269237642829,0.46549306601578272,0.2484503736393544,0.37836789761207545,0.2305482100584435,0.60935546989114597,0.37880725983270258,0.46635444631408179,0.22051256467393041,0.44725814118730195,0.22674557651337154,0.49351326926739209,0.13228980000041027,0.26058405705748472,0.12829425705707445,0.50811165646074929,0.44528532379180946,0.72405525574796004,0.27876993195615046,0.60648780769730182,0.21704269237642829,0.40589752679003793,0.18885483441360959,0.53315951073709633,0.2305482100584435,0.53954733715894421,0.3089991271005007,0.41362831050882104,0.22051256467393041,0.4368050651901238,0.21629250051619339,0.50957375018046869,0.13228980000041027,0.35189125608674465,0.2196014560863345,0.38001102789241031]
[2021,0.44305007828859461,0.82919276682180387,0.38614268853320938,0.53435290652774392,0.20971738929447212,0.45488350431448216,0.24516611502001004,0.37188105210051708,0.22443971662058146,0.6035269478220372,0.37908723120145571,0.46119790203454097,0.21328418692686602,0.43856580166581799,0.22528161473895189,0.48710127358489469,0.1360805496942748,0.26027993883497752,0.12419938914070276,0.52329424134004665,0.44305007828859461,0.71319743536220803,0.27014735707361343,0.62189977192352042,0.20971738929447212,0.39178484462042845,0.18206745532595628,0.53539297886679049,0.22443971662058146,0.53365497838257325,0.30921526176199166,0.42057521603313047,0.21328418692686602,0.42442533529311333,0.21114114836624728,0.50243442439415931,0.1360805496942748,0.33219471655719424,0.19611416686291949,0.40969279495715311]
[2022,0.43917833837639869,0.80931606561055458,0.37013772723415589,0.54271069651917581,0.20871089657597575,0.42912786554174215,0.22041696896576637,0.39261278183391218,0.2263301251187203,0.57680929781371948,0.35047917269499917,0.48751199973519427,0.22317433465901135,0.46544018153638556,0.24226584687737418,0.48010983136213414,0.14746737450977285,0.26481831714892284,0.11735094263915002,0.55628960306949204,0.43917833837639869,0.73499441976619984,0.29581608138980109,0.59777170852240746,0.20871089657597575,0.39812822353862692,0.18941732696265112,0.52533993326521822,0.2263301251187203,0.52534851015791284,0.29901838503919259,0.43094842920168691,0.22317433465901135,0.42504185570910519,0.20186752105009387,0.52599481857795216,0.14746737450977285,0.34585749120332648,0.19839011669355364,0.4282092690122164]

{"sheet":"D.9 Int.","index":25,"n_rows":34,"n_cols":32,"rows_kept":34,"cut":false,"hidden":false,"merged":[]}
[null,null,null,null,null,null,{"$f":"Codierung!I184","v":"Eidgenössisches Departement für  Wirtschaft, Bildung und Forschung WBF"}]
[null,null,null,null,null,null,{"$f":"Codierung!I185","v":"Bundesamt für Landwirtschaft BLW"}]
[null,null,null,null,null,null,{"$f":"Codierung!I186","v":"Fachbereich Marktanalysen"}]
[]
[null,null,null,null,null,{"$f":"Codierung!I242","v":"Anmerkungen:"}]
[{"$f":"Codierung!I179","v":"Internationale Marktzahlen"},null,null,null,null,"(1)",{"$f":"Codierung!I249","v":"Aufgrund der zu kleinen Stichprobe können diese Preise aus datenschutzrechtlichen Gründen nicht mehr publiziert werden"}]
[{"$f":"Codierung!$I$218","v":"in Euro / Ei"},null,null,null,null,"(2)",{"$f":"Codierung!I254","v":"Nur Kleinmengen (Absatz von 1 bis 15 Kartons)"}]
[{"$f":"Codierung!$I$223","v":"in Stück / Kopf"},null,null,null,null,"(3)",{"$f":"Codierung!I250","v":"Produzentenpreise für Eier, welche an Feinkostläden und den Fachhandel geliefert werden (darum nicht repräsentativ für Gesamtmarkt, wo durchschnittlich tiefere Preise ausbezahlt werden)"}]
[{"$f":"Codierung!$I$212","v":"Quellen Preise: AMA Österreich; GfK Austria MEG Deutschland; AMI Deutschland"}]
[{"$f":"Codierung!$I$214","v":"Quellen Pro-Kopf-Verbrauch: BLE; Statistik Austria; EU; USDA; Agri-Food & Veterinary Authority of Singapore"}]
[{"$f":"Codierung!$I$154","v":"Zurück zum Inhaltsverzeichnis"}]
[{"$f":"Codierung!$I$253","v":"Informationen zur Methodik"}]
[null,{"$f":"Codierung!I120","v":"Wechselkurs CHF/Euro"},{"$f":"Codierung!$I$104","v":"Produzentenpreise International"},null,null,null,null,null,null,null,null,null,null,null,null,null,null,null,null,null,{"$f":"Codierung!$I$103","v":"Konsumentenpreise International"},null,null,null,null,null,null,{"$f":"Codierung!$I$31","v":"Pro-Kopf-Verbrauch"}]
[null,null,{"$f":"Codierung!$I$188","v":"Deutschland"},null,null,null,null,null,null,null,null,{"$f":"Codierung!$I$190","v":"Österreich"},null,null,null,null,null,null,null,null,{"$f":"Codierung!$I$188","v":"Deutschland"},null,null,{"$f":"Codierung!$I$190","v":"Österreich"},null,null,null,{"$f":"Codierung!$I$188","v":"Deutschland"},{"$f":"Codierung!$I$190","v":"Österreich"},{"$f":"Codierung!$I$195","v":"EU-15"},{"$f":"Codierung!$I$196","v":"USA"},{"$f":"Codierung!$I$197","v":"Singapur"}]
[null,null,{"$f":"Codierung!$I$10","v":"Bodenhaltung"},null,null,{"$f":"Codierung!$I$77","v":"Freilandhaltung (2)"},null,null,{"$f":"Codierung!$I$76","v":"Bio (3)"},null,null,{"$f":"Codierung!$I$9","v":"Bio"},null,null,{"$f":"Codierung!$I$10","v":"Bodenhaltung"},null,null,{"$f":"Codierung!$I$11","v":"Freilandhaltung"},null,null,{"$f":"Codierung!$I$9","v":"Bio"},{"$f":"Codierung!$I$10","v":"Bodenhaltung"},{"$f":"Codierung!$I$11","v":"Freilandhaltung"},{"$f":"Codierung!$I$9","v":"Bio"},{"$f":"Codierung!$I$9","v":"Bio"},{"$f":"Codierung!$I$10","v":"Bodenhaltung"},{"$f":"Codierung!$I$11","v":"Freilandhaltung"},{"$f":"Codierung!$I$28","v":"Schaleneier"}]
[null,null,"L: 63 - 73 g","M: 53 - 63 g","S: < 53 g","L: 63 - 73 g","M: 53 - 63 g","S: < 53 g","L: 63 - 73 g","M: 53 - 63 g","S: < 53 g","L: 63 - 73 g","M: 53 - 63 g","S: < 53 g","L: 63 - 73 g","M: 53 - 63 g","S: < 53 g","L: 63 - 73 g","M: 53 - 63 g","S: < 53 g",{"$f":"Codierung!$I$119","v":"M, 10er Packung"},{"$f":"Codierung!$I$119","v":"M, 10er Packung"},{"$f":"Codierung!$I$119","v":"M, 10er Packung"},{"$f":"Codierung!$I$117","v":"M, 6er und 10er Packung"},{"$f":"Codierung!$I$118","v":"M, 4er und 6er Packung"},{"$f":"Codierung!$I$117","v":"M, 6er und 10er Packung"},{"$f":"Codierung!$I$117","v":"M, 6er und 10er Packung"},{"$f":"Codierung!$I$223","v":"in Stück / Kopf"},{"$f":"Codierung!$I$223","v":"in Stück / Kopf"},{"$f":"Codierung!$I$223","v":"in Stück / Kopf"},{"$f":"Codierung!$I$223","v":"in Stück / Kopf"},{"$f":"Codierung!$I$223","v":"in Stück / Kopf"}]
[2005,1.5480870079,null,null,null,null,null,null,null,null,null,null,null,null,8.1675000000000011E-2,7.1974999999999997E-2,9.1541666666666646E-2]
[2006,1.5729330677,null,null,null,null,null,null,null,null,null,null,null,null,8.3191666666666678E-2,7.2800000000000004E-2,9.1274999999999995E-2,null,null,null,null,null,null,null,null,null,null,209,null,231.66770513823164,254.13036616815631,291]
[2007,1.6426645418000001,null,null,null,null,null,null,null,null,null,null,null,null,9.8658333333333334E-2,8.8708333333333333E-2,0.11058333333333335,0.10599,0.12135999999999998,0,null,null,null,0.35769661518216134,0.36024512048482898,0.18996553816119832,0.32639881421446804,209,236,228.75404760872144,247.88847862016104,302]
[2008,1.5866648220999999,7.2681818181818181E-2,6.5354545454545457E-2,null,null,null,null,null,null,null,0.19691818181818183,0.18230000000000002,0.20021818181818182,0.11438333333333334,0.10313333333333334,0.12821666666666667,0.11814999999999999,0.136825,0,0.27441666666666664,0.14000000000000001,0.16633333333333333,0.40005897585193317,0.42088969265659654,0.20478695823788645,0.35345788182775179,208,239,226.05446148896081,241.76265470280299,302]
[2009,1.5100711462,9.6516666666666653E-2,8.9883333333333357E-2,null,null,null,null,null,null,null,0.19980000000000001,0.18904999999999997,0.20129166666666665,0.10933333333333334,9.522499999999999E-2,0.12166666666666666,0.12403333333333333,0.14139166666666664,0,0.2865833333333333,0.13883333333333334,0.17275000000000001,0.39788151322285337,0.41819970634222031,0.19849489713251592,0.34041085586388908,210,232,217.77888534029444,242.85514826667435,300]
[2010,1.38053125,8.7241666666666676E-2,7.7416666666666675E-2,null,null,null,null,null,null,null,0.19766666666666666,0.1875083333333333,0.20183333333333331,0.10481666666666667,9.2091666666666669E-2,0.12426666666666665,0.12611666666666668,0.13825833333333334,0,0.28575,0.13499999999999998,0.17433333333333334,0.39388622706174853,0.41125001702944436,0.1984280604350567,0.32654297362923623,214,232.56108002103812,213.32274262791086,247.91409999999999,303]
[2011,1.2335546275,6.4960668498168492E-2,5.8899422442244213E-2,null,null,null,null,null,null,null,0.19745833333333332,0.18675833333333333,0.20224999999999996,0.10203333333333332,8.4066666666666665E-2,0.12505833333333333,0.11744166666666667,0.13749999999999998,0,0.28549999999999998,0.13549999999999998,0.17508333333333331,0.40611818718433385,0.44991717330058417,0.19549023080070813,0.31660455544114113,213,231.8822744533758,210.36242024593838,248.93279999999999,307]
[2012,1.2053079310000001,0.10112499999999999,9.2691666666666658E-2,null,null,null,null,0.26403799999999999,0.25467699999999999,0.141763,0.19969166666666668,0.18818333333333337,0.20255000000000004,0.11052499999999998,8.9799999999999991E-2,0.13545833333333332,0.12055833333333332,0.14375000000000002,0,0.28691666666666665,0.12041666666666669,0.16200000000000001,0.36218784671982135,0.45725643370310465,0.19392461916466555,0.32096891021132473,216.67415435860721,234.46538485373696,205.09344669026487,253.30510000000001,308]
[2013,1.2307930268,7.6083333333333336E-2,6.9483333333333328E-2,4.6674999999999994E-2,null,null,null,0.25571375000000002,0.24831208333333335,0.18249041666666665,0.20255833333333337,0.19253333333333333,0.20541666666666666,0.11456666666666666,9.0924999999999992E-2,0.13694166666666666,0.12685833333333335,0.15415000000000001,0,0.29316666666666669,0.13741666666666666,0.17883333333333334,0.37761021132270495,0.46520226136167847,0.22603321083029113,0.33376017503579464,221.3372230746225,236.28171339694345,211.92557791844837,260.13350000000003,312]
[2014,1.2146290038000001,7.2466666666666665E-2,6.7966666666666661E-2,4.9375000000000009E-2,0.15019999999999997,0.13544999999999999,0.10070833333333333,0.25560833333333333,0.24912499999999999,0.18849166666666664,0.20315000000000003,0.19342499999999999,"(1)",0.11375833333333334,0.10058333333333334,0.13855833333333334,0.132525,0.16188333333333335,0,0.28241666666666665,0.11041666666666668,0.16758333333333333,0.39559392635102275,0.48591750938350364,0.23252461057407858,0.33372643875247637,228.00798783593882,235.41817610004222,210.41138815413089,269.23360000000002,313]
[2015,1.068114636,7.7333333333333337E-2,7.1691666666666667E-2,5.4483333333333342E-2,0.15324166666666664,0.13844999999999999,9.9749999999999991E-2,0.26507500000000006,0.25804999999999995,0.24120833333333336,0.20375833333333329,0.19172500000000003,null,0.10933333333333332,9.2249999999999999E-2,0.12859166666666666,0.12408333333333334,0.15681666666666663,0,0.28408333333333335,0.10833333333333335,0.16566666666666666,null,0.48048888028105102,0.25432486252208553,0.32972987079103794,228.49377685459649,235.70081442688485,213.61948661193148,259.16719999999998,323]
[2016,1.0900899234000001,7.0366666666666661E-2,6.4283333333333331E-2,4.3950000000000003E-2,0.15714166666666665,0.14165,9.5858333333333337E-2,0.26874166666666666,0.2637666666666667,0.2429583333333333,0.20781666666666665,0.1918,null,0.11318333333333336,9.7166666666666679E-2,0.12922499999999998,0.12160833333333333,0.15284166666666668,0,0.30766666666666664,0.12758333333333333,0.18383333333333332,null,0.49537120168526966,0.22263844395697119,0.33866862175345425,230.55690535786297,235.83744228643673,215.90283269457589,278.02609999999999,338]
[2017,1.1115999999999999,9.9216666666666689E-2,9.211666666666668E-2,6.6358333333333339E-2,0.15259166666666665,0.1353,0.10127499999999999,0.27183333333333332,0.26488333333333336,0.24196666666666661,0.21331666666666668,0.19406666666666664,null,0.11695000000000001,0.10146666666666666,0.13085833333333333,0.12343333333333334,0.15399166666666669,0,0.316,0.11999999999999997,0.18783333333333332,null,0.47937167476296427,0.20904418527066709,0.34094361850182214,229.52140755816762,239.46219018852585,219.51599373380301,280.26,349]
[2018,1.1549,9.2891666666666664E-2,8.1791666666666665E-2,6.1166666666666675E-2,0.16314166666666668,0.14200833333333335,0.11060833333333334,0.27346666666666664,0.268125,0.23323333333333335,0.21557499999999996,0.19793333333333332,null,0.12906666666666666,0.11540833333333333,0.14113333333333333,0.13247499999999998,0.15532500000000002,"-",0.32958333333333328,0.13724999999999998,0.19450000000000003,null,0.47786744901062655,0.20594357600181107,0.33653875717368131,233.66917593201242,240.0808361922829,226.05052337818339,287.4941,358]
[2019,1.1125,8.3049999999999999E-2,7.2458333333333333E-2,5.3200000000000004E-2,0.18975,0.16816666666666666,9.862499999999999E-2,0.27752500000000002,0.27239166666666664,0.22146666666666665,0.24871666666666667,0.23347500000000002,null,0.12827499999999997,0.11586666666666667,"-",0.13624999999999998,0.15666666666666668,"-",0.32991666666666664,0.12724999999999997,0.18841666666666665,null,0.49048021183088625,0.20793334635019303,0.33713046326963114,235.13625523611299,242.30987749864698,225.72769878190414,293.39920000000001,360]
[2020,1.0705,7.839999999999997E-2,6.9200000000000012E-2,5.3274999999999996E-2,0.15472499999999997,0.13004166666666669,0.10050833333333334,0.28094999999999998,0.27615833333333328,0.21585833333333329,0.26663333333333333,0.24979166666666666,null,0.12431666666666669,0.11055833333333333,"-",0.14084166666666667,0.16664166666666669,"-",0.32808333333333339,0.13566666666666666,0.19433333333333333,null,0.49311518844200769,0.20677108304925762,0.32342497381033897,242.25263020638286,235.72690919422701,224.92798815587034,286.53890000000001,388]
[2021,1.081,7.6141666666666663E-2,6.695000000000001E-2,5.333333333333333E-2,0.17871666666666666,0.16172500000000004,0.11937499999999998,0.26200000000000001,0.25886666666666669,0.20013333333333336,0.28243333333333337,0.27041666666666669,null,0.12724166666666667,0.11244999999999999,"-",0.14514166666666667,0.19597499999999998,"-",0.34208333333333341,0.15575,0.21600000000000003,null,0.5176694580741088,0.21072768449354171,0.33212013096203802,237.50800769971121,233,229.291042762128,280.49380000000002,390]
[2022,1.0047999999999999,0.12063333333333333,0.108975,8.9141666666666661E-2,0.21506666666666663,0.19900833333333334,0.14920833333333333,0.20582500000000001,0.20220833333333332,0.16621666666666665,0.324075,0.30988333333333329,null,0.16635833333333336,0.15109166666666665,"-",0.18720833333333334,0.25839166666666663,"-",0.36116666666666664,0.1946666666666666,0.24341666666666667,null,0.55805372886811888,0.26380078049034278,0.34648314374457995]

{"sheet":"10. Methoden","index":26,"n_rows":88,"n_cols":5,"rows_kept":88,"cut":false,"hidden":false,"merged":[]}
[null,null,null,null,{"$f":"Codierung!I184","v":"Eidgenössisches Departement für  Wirtschaft, Bildung und Forschung WBF"}]
[null,null,null,null,{"$f":"Codierung!I185","v":"Bundesamt für Landwirtschaft BLW"}]
[null,null,null,null,{"$f":"Codierung!I186","v":"Fachbereich Marktanalysen"}]
[]
[]
[{"$f":"Codierung!I181","v":"Methoden"}]
[]
[{"$f":"Codierung!$I$154","v":"Zurück zum Inhaltsverzeichnis"}]
[]
[null,{"$f":"Codierung!I267","v":"Produktion, Aussenhandel und Verbrauch"}]
[null,{"$f":"Codierung!I268","v":"■   Die Bevölkerungsschätzung stammt vom SBV und dient zur Berechnung des Pro-Kopf-Verbrauchs in der Schweiz. In der Schätzung enthalten sind ebenfalls Touristen und Grenzgänger."}]
[null,{"$f":"Codierung!I269","v":"■   Die Inlandproduktion wird anhand der „Kükenstatistik“ geschätzt und stammt vom Aviforum."}]
[null,{"$f":"Codierung!I270","v":"■   Die Aussenhandelszahlen stammen vom BAZG."}]
[null,{"$f":"Codierung!I271","v":"   o   Importe werden jeweils abzüglich der Exporte (in vernachlässigbarer Grössenordnung) sowie ohne Rückwaren und Importe von Produkten zu technischen Zwecken (etwa der Forschung) dargestellt."}]
[null,{"$f":"Codierung!I272","v":"   o   Der Veredelungsverkehr fliesst nicht in die Aussenhandelsstatistik ein (siehe dazu unten Abschnitt \"Aktiver Veredelungsverkehr (aVV)\")."}]
[null,{"$f":"Codierung!I273","v":"■   Die Menge der Schweizer Verarbeitungseier basiert auf einer Datenerhebung des Fachbereichs Marktanalysen bei Unternehmen und Geflügelbetrieben mit eigener Eierverarbeitung."}]
[null,{"$f":"Codierung!I274","v":"■   Der Eier-Verbrauch entspricht der Summe der im Inland produzierten Eier und der importierten Eier und Eiprodukte abzüglich der Exporte von Ei- und Eiprodukten. Nicht berücksichtigt im Verbrauch werden Eier, welche in verarbeiteter Form, welche über den Verarbeitungsgrad von Eiprodukten hinausgeht, importiert werden (z.B. als Back- und Teigwaren, Süssigkeiten etc.) sowie die Ei-Verluste, welche im Lauf durch die Wertschöpfungskette entstehen (Food Waste). Der Einkaufstourismus ist ebenfalls nicht in der Rechnung enthalten."}]
[null,{"$f":"Codierung!I275","v":"■   Der Pro-Kopf-Verbrauch entspricht den konsumierten Eiern (unter „Verbrauch Inland“) pro Kopf (unter „Bevölkerung“)."}]
[null,{"$f":"Codierung!I276","v":"Aktiver Veredelungsverkehr (aVV)"}]
[null,{"$f":"Codierung!I277","v":"■   Der aktive Veredelungsverkehr ist umfasst die vorübergehende Einfuhr von Waren zur Bearbeitung, Verarbeitung und Ausbesserung. "}]
[null,{"$f":"Codierung!I278","v":"■   Erfasst werden die Importe und Re-Exporte in den Zolltarifnummern 0407, 0408 und 3502. Die Re-Exporte von im aktiven Veredelungsverkehr importierten Eiern, welche unter anderen als die genannten Zolltarifnummern wieder re-exportiert werden, werden nicht erfasst."}]
[null,{"$f":"Codierung!I279","v":"■   Die Eier-Statistik zum passiven Veredelungsverkehr wird aus Datenschutzgründen und aufgrund der geringen Relevanz nicht veröffentlicht."}]
[null,{"$f":"Codierung!I280","v":"Marktentlastungsmassnahmen des Bundes (MEM)"}]
[null,{"$f":"Codierung!I281","v":"■   Die Marktentlastungsmassnahmen des Bundes dienen zur Angebotsstabilisierung während der Eier-Nebensaison (etwa nach Ostern). Die Erhebung der von den Massnahmen betroffenen Eier erfolgt durch das BLW."}]
[]
[null,{"$f":"Codierung!I282","v":"Produzentenpreise"}]
[null,{"$f":"Codierung!I283","v":"■   Der Produzentenpreis ist der Nettopreis pro Ei ab Hof, mit Hofdatierung und Mengenzuschläge. Direktzahlungen für tierfreundliche Haltungsformen und Futter- sowie Junghennenverträge sind nicht inbegriffen. Es handelt sich um einen gemischten Preis über alle Gewichtsklassen inklusive den Eiern der zweiten Klasse (Bruch, Blut, Schmutz, Kaliber). Die Produzentenpreise werden nach den drei Haltungs- bzw. Produktionsformen Bio, Bodenhaltung und Freilandhaltung differenziert. Die Erhebung erfolgt monatlich bei fünf wichtigen schweizerischen Pack- und Sammelstellen. Die Produzentenpreise sind nach Stückzahl der umgesetzten Eier gewichtet."}]
[null,{"$f":"Codierung!I284","v":"Preise im Liefer- und Abholgrosshandel"}]
[null,{"$f":"Codierung!I285","v":"■   Preise im Liefer- und Abholgrosshandel sind nach Absatz gewichtete Abverkaufspreise. Rund 80 % des nationalen Liefer- und Abholgrosshandels in der Schweiz werden damit erfasst (Prodega/Growa, Transgourmet, Pistor, Scana und CCA Angehrn bilden die Grundgesamtheit der Auswertung). Die Roh-Daten werden von der Grossopanel AG gesammelt und dem BLW in definierter Form zur Verfügung gestellt."}]
[null,{"$f":"Codierung!I286","v":"Konsumentenpreise"}]
[null,{"$f":"Codierung!I287","v":"Erhebungsdaten"}]
[null,{"$f":"Codierung!I288","v":"■   Die Daten stammen aus monatlichen, regionalen Erhebungen bei zwei schweizerischen Grossverteilern, zwei Verbrauchermärkten, einem Warenhaus und drei Discountern. Die Erhebungen decken knapp 90 % des inländischen Eiermarktes ab. Die restlichen Eier werden über Direktvermarktung der Produzenten und anderer Verkaufsstellen abgesetzt."}]
[null,{"$f":"Codierung!I289","v":"Folgende Kriterien werden bei der Erhebung berücksichtigt:"}]
[null,{"$f":"Codierung!I290","v":"■   Anzahl Schachteln linear"}]
[null,{"$f":"Codierung!I291","v":"Die Anzahl der Schachteln in der vordersten Regalreihe dienen als Gewichtungsfaktor für die Verkaufsmenge."}]
[null,{"$f":"Codierung!I292","v":"■   Art der Tierhaltung"}]
[null,{"$f":"Codierung!I293","v":"Die Erhebungen basieren auf den Produktionsformen Bodenhaltung, Freilandhaltung, Bio, 5-Getreide (pflanzliches Futter), Vital Omega 3 und AGRI-NATURA. Bei der Berechnung werden Auslaufhaltung, Freilandhaltung, und AGRI-NATURA zu Freiland- und Auslaufhaltung zusammengefasst. Die Gruppen 5-Getreide und Vital Omega 3 bilden die Gruppe Spezial (Omega 3, 5-Getreide etc.)."}]
[null,{"$f":"Codierung!I294","v":"■   Frisch / Gekocht"}]
[null,{"$f":"Codierung!I295","v":"Die Erhebung differenziert zwischen rohen Eiern und gekochten Eiern."}]
[null,{"$f":"Codierung!I296","v":"■   Anzahl Eier pro Schachtel"}]
[null,{"$f":"Codierung!I297","v":"Das Angebot beinhaltet die Schachtelgrössen 2er, 4er, 6er, 8er, 9er,10er, 12er, 15er,18er, 20er, 30er und einzelne Eier."}]
[null,{"$f":"Codierung!I298","v":"■   Gewichtsklasse"}]
[null,{"$f":"Codierung!I299","v":"Das Gewicht der Eier wird in die drei Gewichtsklassen <50 g, 50-53 g und >53 g aufgeteilt."}]
[null,{"$f":"Codierung!I300","v":"■   Herkunft (Inland / Import)"}]
[null,{"$f":"Codierung!I301","v":"■   Preis in Fr./Schachtel"}]
[null,{"$f":"Codierung!I302","v":"■   Aktionen"}]
[null,{"$f":"Codierung!I303","v":"Aktionen fliessen mit dem Faktor 1.5 in die Berechnung ein. Die nationalen Aktionen werden ab 09.2006 wöchentlich berücksichtigt."}]
[null,{"$f":"Codierung!I304","v":"Methodik Berechnung"}]
[null,{"$f":"Codierung!I305","v":"Gewichtungsdaten"}]
[null,{"$f":"Codierung!I306","v":"■   Gewichtung nach Kanal (Quelle GfK AG)"}]
[null,{"$f":"Codierung!I307","v":"■   Gewichtung nach Region (Quelle BfS)"}]
[null,{"$f":"Codierung!I308","v":"Die Regionen werden wie folgt abgegrenzt:"}]
[null,{"$f":"Codierung!I309","v":"Region I: Genf, Waadt, Freiburg, Neuenburg, Jura und Teile des französischsprachigen Gebiets des Kantons Bern (Verwaltungskreis Berner Jura)."}]
[null,{"$f":"Codierung!I310","v":"Region II: Bern (ausser Verwaltungskreis Berner Jura), Luzern, Unterwalden (Obwalden, Nidwalden), Uri, Zug und ein Teil des Kantons Schwyz (Bezirke Schwyz, Gersau und Küssnacht)."}]
[null,{"$f":"Codierung!I311","v":"Region III: Baselland und Basel-Stadt, Aargau und Solothurn."}]
[null,{"$f":"Codierung!I312","v":"Region IV: Zürich, Schaffhausen, Thurgau, Appenzell (Innerrhoden und Ausserrhoden), St. Gallen, ein Teil des Kantons Schwyz (Bezirke Einsiedeln, March und Höfe), Glarus, Graubünden."}]
[null,{"$f":"Codierung!I313","v":"Region V: Wallis und Tessin."}]
[null,{"$f":"Codierung!I314","v":"Berechnung"}]
[null,{"$f":"Codierung!I315","v":"Anzahl Eier linear inkl. Aktionen:"}]
[null,{"$f":"Codierung!I316","v":"= SL * ES * GA"}]
[null,{"$f":"Codierung!I317","v":"Anzahl Eier linear pro Geschäft:"}]
[null,{"$f":"Codierung!I318","v":"= Summe (SL*ES*GA)"}]
[null,{"$f":"Codierung!I319","v":"Angebot in % vom Gesamtangebot (pro Laden):"}]
[null,{"$f":"Codierung!I320","v":"= (SL*ES*GA) / (Summe(SL*ES*GA))"}]
[null,{"$f":"Codierung!I321","v":"Gewichtungsschlüssel:"}]
[null,{"$f":"Codierung!I322","v":"= (SL*ES*GA) / (Summe (SL*ES*GA)) * GR * GK"}]
[null,{"$f":"Codierung!I323","v":"Preis pro Ei:"}]
[null,{"$f":"Codierung!I324","v":"= PS / ES"}]
[null,{"$f":"Codierung!I325","v":"Gewichteter Preis:"}]
[null,{"$f":"Codierung!I326","v":"= (PS/ES)*(SL*ES*GA)/(SUMME(SL*ES *GA))*GR*GK"}]
[null,{"$f":"Codierung!I327","v":"Legende:"}]
[null,{"$f":"Codierung!I328","v":"SL: Anzahl Schachteln linear"}]
[null,{"$f":"Codierung!I329","v":"ES: Anzahl Eier pro Schachtel"}]
[null,{"$f":"Codierung!I330","v":"GA: Gewichtung Aktionen"}]
[null,{"$f":"Codierung!I331","v":"GR: Gewichtung Regionen"}]
[null,{"$f":"Codierung!I332","v":"GK: Gewichtung Kanäle"}]
[null,{"$f":"Codierung!I333","v":"PS: Preis pro Schachtel"}]
[null,{"$f":"Codierung!I334","v":"Bruttowertschöpfung"}]
[null,{"$f":"Codierung!I335","v":"Definition Einstandspreis"}]
[null,{"$f":"Codierung!I336","v":"Der Einstandspreis errechnet sich aus dem Wert der Produzentenpreise für Schweizer Konsumeier inklusive der für die Verarbeitung bestimmten Eier (2. Klasse) und der importierten Konsum- und Verarbeitungseier (inkl. Zoll). Der Einstandspreis wird ohne Mehrwertsteuer (o.MwSt.) als Realwert (Festpreise von Dezember 2010) ausgedrückt. Zur Berechnung der Bruttowertschöpfung für Schweizer Eier der Produktionsformen Bio, Bodenhaltung und Freilandhaltung wird der vereinfachte Einstandspreis ohne Importe und ohne Verarbeitungseier herangezogen. Die Berechnung basiert auf einem dynamischen Mengengerüst. Als Grundlage dienen die Mengenverhältnisse der erhobenen Konsumentenpreise und die Produktion an Schweizer Schaleneiern (Quelle: Aviforum). Bei den Importeiern und den staatlichen Marktentlastungen handelt es sich um absolute Mengen. Interne Deklassierungen von Label- oder Freilandeiern zu Bodenhaltungseiern werden nicht in die Berechnung miteinbezogen."}]
[null,{"$f":"Codierung!I337","v":"Definition Nettoeinnahmen im Liefer- und Abholgrosshandel und im Detailhandel"}]
[null,{"$f":"Codierung!I338","v":"Die Nettoeinnahmen bestehen aus den beobachteten, gewichteten Preisen im Liefer- und Abholgrosshandel bzw. den Konsumentenpreisen für frische und gekochte Konsumeier, den Werten der aufgeschlagenen inländischen und importierten Verarbeitungseiern zu Grosshandelspreisen und den Eiern der durchgeführten Marktentlastungsmassnahmen. Die Nettoeinnahmen verstehen sich ohne Mehrwertsteuer (o.MwSt.) zu Realwerten (Festpreise von Dezember 2010). Zur Berechnung der Bruttowertschöpfung für Schweizer Eier der Produktionsformen Bio, Bodenhaltung und Freilandhaltung werden die vereinfachten Nettoeinnahmen ohne Importeier, Verarbeitungseier und ohne staatliche Marktentlastungen herangezogen."}]
[null,{"$f":"Codierung!I339","v":"Definition Bruttowertschöpfung"}]
[null,{"$f":"Codierung!I340","v":"Die Bruttowertschöpfung ist die Differenz aus den definierten Nettoeinnahmen und den definierten Einstandspreisen ohne Mehrwertsteuer (o.MwSt.) zu Realwerten (Festpreis von Dezember 2010). Die Bruttowertschöpfung wird jeweils separat auf den Stufen Liefer- und Abholgrosshandel sowie Detailhandel berechnet. Sie verkörpert einen Schätzwert der effektiven Wertschöpfung auf den Konsumeiern im Ladenverkauf und dient nur als Indikator für die wirkliche Wertschöpfung der Pack- / Sammelstellen und der Verteiler. Bei der Bruttowertschöpfung gesamt fliessen die Importe, die Verarbeitungseier und die Marktentlastungsmassnahmen in die Berechnung mit ein. Die Verkäufe der Pack- und Sammelstellen direkt an Gewerbebetriebe (Restaurants, Bäckereien etc.) und an Kollektivhaushalte sowie die Direktvermarktung ab Hof wird in der Berechnung nicht berücksichtigt. Die Berechnung der Bruttowertschöpfung gesamt beruht auf der Annahme, dass sämtliche Konsumeier über den jeweiligen Kanal (Liefer- und Abholgrosshandel bzw. Detailhandel) abgesetzt werden."}]
[null,{"$f":"Codierung!I341","v":"Produzentenpreisanteil am Konsumenten- bzw. Gastronomenfranken"}]
[null,{"$f":"Codierung!I342","v":"Der Anteil des Produzentenpreises am Konsumenten- bzw. Gastronomenfranken entspricht dem Erlösanteil am Rohertrag, welcher der Landwirt durch den Verkauf der Eier im Verhältnis zu den Einnahmen im Detailhandel bzw. im Liefer- und Abholgrosshandel erwirtschaftet."}]
[null,{"$f":"Codierung!I343","v":"International"}]
[null,{"$f":"Codierung!I344","v":"Internationale Preise werden sowohl auf Produzenten- als auch auf Konsumentenstufe erhoben. Erfasst werden die Preise in Deutschland und Österreich. Die Datenquellen sind vorwiegend privatrechtliche Institutionen und Bundesämter."}]

{"sheet":"Codierung","index":27,"n_rows":381,"n_cols":12,"rows_kept":381,"cut":false,"hidden":true,"merged":[[0,0,0,1],[7,0,7,1]]}
[null,null,null,null,"Monate",null,1,null,{"$f":"IF(Codierung!G1=1,\"d\",IF(Codierung!G1=2,\"f\",\"i\"))","v":"d"},"d (Deutsch)","f (Französisch)","i (Italienisch)"]
[null,null,null,null,"01",1,"Deutsch","Bruttowertschöpfung",{"$f":"IF($I$1=\"d\",J2,IF($I$1=\"f\",K2,IF($I$1=\"i\",L2)))","v":"Einstandspreis "},"Einstandspreis ","Prix de revient ","Prezzo di costo "]
[null,null,null,null,"02",2,"Français",null,{"$f":"IF($I$1=\"d\",J3,IF($I$1=\"f\",K3,IF($I$1=\"i\",L3)))","v":"Nettoeinnahmen "},"Nettoeinnahmen ","Recettes nettes ","Entrate (vendite) nette "]
[null,null,null,null,"03",3,"Italiano",null,{"$f":"IF($I$1=\"d\",J4,IF($I$1=\"f\",K4,IF($I$1=\"i\",L4)))","v":"Bruttowertschöpfung"},"Bruttowertschöpfung","Valeur ajoutée brute","Valore aggiunto lordo"]
[null,null,null,null,"04",null,null,null,{"$f":"IF($I$1=\"d\",J5,IF($I$1=\"f\",K5,IF($I$1=\"i\",L5)))","v":"Produzentenpreisanteil am Konsumentenfranken"},"Produzentenpreisanteil am Konsumentenfranken","Part des prix au producteur au franc dépensé par le consommateur","Quota del prezzo alla produzione per ogni franco speso dal consumatore"]
[null,null,null,null,"05",null,null,null,{"$f":"IF($I$1=\"d\",J6,IF($I$1=\"f\",K6,IF($I$1=\"i\",L6)))","v":"Produzentenpreisanteil am Gastronomenfranken"},"Produzentenpreisanteil am Gastronomenfranken","Part des prix au producteur au franc dépensé par le restaurateur","Quota del prezzo alla produzione per ogni franco speso dal ristoratore"]
[null,null,null,null,"06",null,null,null,"Bruttowertschöpfung auf Stufe Verarbeitung und Verteilung","Bruttowertschöpfung auf Stufe Verarbeitung und Verteilung","Valeur ajoutée brute de la transformation et de la distribution","Valore aggiunto lordo a livello di trasformazione e distribuzione"]
[null,null,null,null,"07",null,null,null,"Bruttowertschöpfung auf Stufe Verarbeitung für Gastronomie / Ausserhausverpflegung","Bruttowertschöpfung auf Stufe Verarbeitung für Gastronomie / Ausserhausverpflegung","Valeur ajoutée brute de la transformation opérant p. la restauration / rest. hors domicile","Valore aggiunto lordo a livello di trasformazione per ristorazione / consumo fuori casa"]
[null,null,null,null,"08",null,null,null,"Bio","Bio","bio","biologico"]
[null,null,null,null,"09",null,null,null,"Bodenhaltung","Bodenhaltung","au sol","allevamento al suolo"]
[null,null,null,null,"10",null,null,null,"Freilandhaltung","Freilandhaltung","plein air","allevamento all'aperto"]
[{"$f":"Codierung!$I$154","v":"Zurück zum Inhaltsverzeichnis"},null,null,null,"11",null,null,null,"Inland und Import","Inland und Import","Suisse et importations","indigene i importante"]
[null,null,null,null,"12",null,null,null,"Konsumeier Import","Konsumeier Import","Œufs de consommation importés","uova di consumo importante"]
["Dashboard:",null,null,null,null,null,null,null,{"$f":"IF($I$1=\"d\",J14,IF($I$1=\"f\",K14,IF($I$1=\"i\",L14)))","v":"Verarbeitung und Verteilung"},"Verarbeitung und Verteilung","secteurs de la transformation et de la distribution","Trasformazione e distribuzione "]
[null,null,null,null,null,null,null,null,"Verarbeitung für Gastronomie / Ausserhausverpflegung ","Verarbeitung für Gastronomie / Ausserhausverpflegung ","Secteur de la transformation opérant pour la restauration / rest. hors domicile","Trasformazione per ristorazione / consumo fuori casa "]
[null,null,null,null,null,null,null,"Produktion und Import",{"$f":"IF($I$1=\"d\",J16,IF($I$1=\"f\",K16,IF($I$1=\"i\",L16)))","v":"Inlandproduktion Schaleneier"},"Inlandproduktion Schaleneier","Production indigène d'oeufs en coquille","Produzione di uova indigene "]
[{"$f":"Codierung!$I$252&'D.6 KP'!$A$15&\"-\"&'D.6 KP'!$A$19","v":"Ø 2001-2005"},{"$f":"Codierung!$I$252&'D.6 KP'!$A$20&\"-\"&'D.6 KP'!$A$24","v":"Ø 2006-2010"},{"$f":"'6. KP'!E12","v":2021},{"$f":"'6. KP'!F12","v":2022},null,null,null,null,"Import Konsumeier","Import Konsumeier","Œufs de consommation importés","Importazione uova di consumo"]
[{"$f":"'5. GHP'!C12","v":2019},{"$f":"'5. GHP'!D12","v":2020},{"$f":"'5. GHP'!E12","v":2021},{"$f":"'5. GHP'!F12","v":2022},null,null,null,null,"Import Verarbeitungseier in Schale","Import Verarbeitungseier in Schale","Importation d'oeufs de fabrication en coquille","Importazione uova di transformazione in guscio"]
[null,null,null,null,null,null,null,null,"Import Eiprodukte getrocknet","Import Eiprodukte getrocknet","Importation de produits à base d'oeufs séchés","Importazione Prodotti di uova esseccati"]
["Entwicklung Preise",null,null,null,null,null,null,null,"Import Eiprodukte andere als getrocknet","Import Eiprodukte andere als getrocknet","Importation de produits à base d'oeufs autres que séchés","Importazione Prodotti di uova non esseccati"]
[{"$f":"'4. PP'!$E$12&\"/\"&'4. PP'!$F$12","v":"2021/2022"},"Produktion","Grosshandel","Detailhandel",null,null,null,null,"Import Schaleneier","Import Schaleneier","Importation d'oeufs en coquille","Importazione uova in guscio"]
["Bio",{"$f":"IF('4. PP'!I18>0,IF(LEN(\"+\"&ROUND('4. PP'!I18,1)&\" %\")<6,\"+\"&ROUND('4. PP'!I18,1)&\".0 %\",\"+\"&ROUND('4. PP'!I18,1)&\" %\"),IF(LEN(ROUND('4. PP'!I18,1)&\" %\")<6,ROUND('4. PP'!I18,1)&\".0 %\",ROUND('4. PP'!I18,1)&\" %\"))","v":"+2.5 %"},{"$f":"IF('5. GHP'!I14>0,IF(LEN(\"+\"&ROUND('5. GHP'!I14,1)&\" %\")<6,\"+\"&ROUND('5. GHP'!I14,1)&\".0 %\",\"+\"&ROUND('5. GHP'!I14,1)&\" %\"),IF(LEN(ROUND('5. GHP'!I14,1)&\" %\")<6,ROUND('5. GHP'!I14,1)&\".0 %\",ROUND('5. GHP'!I14,1)&\" %\"))","v":"+2.9 %"},{"$f":"IF('6. KP'!I14>0,IF(LEN(\"+\"&ROUND('6. KP'!I14,1)&\" %\")<6,\"+\"&ROUND('6. KP'!I14,1)&\".0 %\",\"+\"&ROUND('6. KP'!I14,1)&\" %\"),IF(LEN(ROUND('6. KP'!I14,1)&\" %\")<6,ROUND('6. KP'!I14,1)&\".0 %\",ROUND('6. KP'!I14,1)&\" %\"))","v":"+0.8 %"},null,null,null,null,"für Konsum","für Konsum","de consommation","di consumo"]
["Bodenhaltung",{"$f":"IF('4. PP'!I24>0,IF(LEN(\"+\"&ROUND('4. PP'!I24,1)&\" %\")<6,\"+\"&ROUND('4. PP'!I24,1)&\".0 %\",\"+\"&ROUND('4. PP'!I24,1)&\" %\"),IF(LEN(ROUND('4. PP'!I24,1)&\" %\")<6,ROUND('4. PP'!I24,1)&\".0 %\",ROUND('4. PP'!I24,1)&\" %\"))","v":"+2.6 %"},{"$f":"IF('5. GHP'!I15>0,IF(LEN(\"+\"&ROUND('5. GHP'!I15,1)&\" %\")<6,\"+\"&ROUND('5. GHP'!I15,1)&\".0 %\",\"+\"&ROUND('5. GHP'!I15,1)&\" %\"),IF(LEN(ROUND('5. GHP'!I15,1)&\" %\")<6,ROUND('5. GHP'!I15,1)&\".0 %\",ROUND('5. GHP'!I15,1)&\" %\"))","v":"+5.8 %"},{"$f":"IF('6. KP'!I15>0,IF(LEN(\"+\"&ROUND('6. KP'!I15,1)&\" %\")<6,\"+\"&ROUND('6. KP'!I15,1)&\".0 %\",\"+\"&ROUND('6. KP'!I15,1)&\" %\"),IF(LEN(ROUND('6. KP'!I15,1)&\" %\")<6,ROUND('6. KP'!I15,1)&\".0 %\",ROUND('6. KP'!I15,1)&\" %\"))","v":"-6.5 %"},null,null,null,null,"für Verarbeitung","für Verarbeitung","de fabrication","di trasformazione"]
["Freilandhaltung",{"$f":"IF('4. PP'!I30>0,IF(LEN(\"+\"&ROUND('4. PP'!I30,1)&\" %\")<6,\"+\"&ROUND('4. PP'!I30,1)&\".0 %\",\"+\"&ROUND('4. PP'!I30,1)&\" %\"),IF(LEN(ROUND('4. PP'!I30,1)&\" %\")<6,ROUND('4. PP'!I30,1)&\".0 %\",ROUND('4. PP'!I30,1)&\" %\"))","v":"+4.0 %"},{"$f":"IF('5. GHP'!I16>0,IF(LEN(\"+\"&ROUND('5. GHP'!I16,1)&\" %\")<6,\"+\"&ROUND('5. GHP'!I16,1)&\".0 %\",\"+\"&ROUND('5. GHP'!I16,1)&\" %\"),IF(LEN(ROUND('5. GHP'!I16,1)&\" %\")<6,ROUND('5. GHP'!I16,1)&\".0 %\",ROUND('5. GHP'!I16,1)&\" %\"))","v":"+1.0 %"},{"$f":"IF('6. KP'!I16>0,IF(LEN(\"+\"&ROUND('6. KP'!I16,1)&\" %\")<6,\"+\"&ROUND('6. KP'!I16,1)&\".0 %\",\"+\"&ROUND('6. KP'!I16,1)&\" %\"),IF(LEN(ROUND('6. KP'!I16,1)&\" %\")<6,ROUND('6. KP'!I16,1)&\".0 %\",ROUND('6. KP'!I16,1)&\" %\"))","v":"-0.5 %"},null,null,null,null,"Import Eiprodukte","Import Eiprodukte","Importation de produits à base d'oeufs","Importazione Prodotti di uova"]
["CH gesamt",{"$f":"IF('4. PP'!I32>0,IF(LEN(\"+\"&ROUND('4. PP'!I32,1)&\" %\")<6,\"+\"&ROUND('4. PP'!I32,1)&\".0 %\",\"+\"&ROUND('4. PP'!I32,1)&\" %\"),IF(LEN(ROUND('4. PP'!I32,1)&\" %\")<6,ROUND('4. PP'!I32,1)&\".0 %\",ROUND('4. PP'!I32,1)&\" %\"))","v":"+5.0 %"},{"$f":"IF('5. GHP'!I17>0,IF(LEN(\"+\"&ROUND('5. GHP'!I17,1)&\" %\")<6,\"+\"&ROUND('5. GHP'!I17,1)&\".0 %\",\"+\"&ROUND('5. GHP'!I17,1)&\" %\"),IF(LEN(ROUND('5. GHP'!I17,1)&\" %\")<6,ROUND('5. GHP'!I17,1)&\".0 %\",ROUND('5. GHP'!I17,1)&\" %\"))","v":"+0.6 %"},{"$f":"IF('6. KP'!I17>0,IF(LEN(\"+\"&ROUND('6. KP'!I17,1)&\" %\")<6,\"+\"&ROUND('6. KP'!I17,1)&\".0 %\",\"+\"&ROUND('6. KP'!I17,1)&\" %\"),IF(LEN(ROUND('6. KP'!I17,1)&\" %\")<6,ROUND('6. KP'!I17,1)&\".0 %\",ROUND('6. KP'!I17,1)&\" %\"))","v":"+1.3 %"},null,null,null,null,"getrocknet","getrocknet","séchés","esseccati"]
["Konsumeier Import",{"$f":"IF('4. PP'!I34>0,IF(LEN(\"+\"&ROUND('4. PP'!I34,1)&\" %\")<6,\"+\"&ROUND('4. PP'!I34,1)&\".0 %\",\"+\"&ROUND('4. PP'!I34,1)&\" %\"),IF(LEN(ROUND('4. PP'!I34,1)&\" %\")<6,ROUND('4. PP'!I34,1)&\".0 %\",ROUND('4. PP'!I34,1)&\" %\"))","v":"+9.6 %"},{"$f":"IF('5. GHP'!I18>0,IF(LEN(\"+\"&ROUND('5. GHP'!I18,1)&\" %\")<6,\"+\"&ROUND('5. GHP'!I18,1)&\".0 %\",\"+\"&ROUND('5. GHP'!I18,1)&\" %\"),IF(LEN(ROUND('5. GHP'!I18,1)&\" %\")<6,ROUND('5. GHP'!I18,1)&\".0 %\",ROUND('5. GHP'!I18,1)&\" %\"))","v":"+7.8 %"},{"$f":"IF('6. KP'!I18>0,IF(LEN(\"+\"&ROUND('6. KP'!I18,1)&\" %\")<6,\"+\"&ROUND('6. KP'!I18,1)&\".0 %\",\"+\"&ROUND('6. KP'!I18,1)&\" %\"),IF(LEN(ROUND('6. KP'!I18,1)&\" %\")<6,ROUND('6. KP'!I18,1)&\".0 %\",ROUND('6. KP'!I18,1)&\" %\"))","v":"+3.9 %"},null,null,null,null,"andere als getrocknet","andere als getrocknet","autres que séchés","non esseccati"]
[null,null,null,null,null,null,null,null,"Bevölkerung","Bevölkerung","Population","Popolazione"]
["Mengen",null,null,null,null,null,null,null,"Schaleneier","Schaleneier","Œufs en coquille","Uova in guscio"]
["Import Total",null,null,null,null,null,null,null,"Eiprodukte (5)","Eiprodukte (5)","Ovoproduits (5)","Prodotti di uova (5)"]
[{"$f":"SUM('1. Prod + AH + Verbrauch'!E21,'1. Prod + AH + Verbrauch'!E24:E25)","v":655.09147814800008},{"$f":"SUM('1. Prod + AH + Verbrauch'!F21,'1. Prod + AH + Verbrauch'!F24:F25)","v":668.34274986800006},{"$f":"SUM('1. Prod + AH + Verbrauch'!G21,'1. Prod + AH + Verbrauch'!G24:G25)","v":572.06488307248014},{"$f":"SUM('1. Prod + AH + Verbrauch'!H21,'1. Prod + AH + Verbrauch'!H24:H25)","v":519.28699853400008},{"$f":"IFERROR((D30-C30)/C30*100,\"-\")","v":-9.2258563845096475},null,null,null,"Verbrauch Inland","Verbrauch Inland","Consommation indigène","Consumo CH"]
[null,null,null,null,null,null,null,null,"Pro-Kopf-Verbrauch","Pro-Kopf-Verbrauch","Consommation par habitant","Consumo pro capite"]
["Anteile Angebot",{"$f":"'1. Prod + AH + Verbrauch'!H14","v":2022},null,null,"Imp.LM:",null,null,null,"Inland","Inland","Suisse","Svizzera"]
[{"$f":"'1. Prod + AH + Verbrauch'!C28","v":"Inland"},{"$f":"'1. Prod + AH + Verbrauch'!H39","v":0.68604589358892631},null,null,2005,null,null,null,"Import (abzügl. Exporte und Rückwaren)","Import (abzügl. Exporte und Rückwaren)","Importations (moins les exportations et marchandises en retour)","Importazione (al netto di esportazioni e merce resa)"]
[{"$f":"'1. Prod + AH + Verbrauch'!C29","v":"Import"},{"$f":"'1. Prod + AH + Verbrauch'!H40","v":0.3139541064110738},null,null,{"$f":"E33&\"..\"&B32","v":"2005..2022"},null,null,null,"Schaleneier (exkl. Verarbeitungseier)","Schaleneier (exkl. Verarbeitungseier)","Œufs en coquille (sauf les œufs destinés à la transformation)","Uova in guscio (escl. uova di trasformazione)"]
[null,null,null,null,null,null,null,null,"Eiprodukte (inkl. Verarbeitungseier)","Eiprodukte (inkl. Verarbeitungseier)","Ovoproduits (y compris les œufs destinés à la transformation)","Prodotti di uova (incl. uova di trasformazione)"]
["Entwicklung Mengen",null,null,null,null,null,null,null,"Total","Total","Total","Totale"]
[{"$f":"'4. PP'!$E$12&\"/\"&'4. PP'!$F$12","v":"2021/2022"},null,null,"Pro-Kopf-Verbrauch",null,null,null,null,"Eiprodukte","Eiprodukte","Ovoproduits","Prodotti di uova"]
["Inland",{"$f":"IF('1. Prod + AH + Verbrauch'!K18>0,IF(LEN(\"+\"&ROUND('1. Prod + AH + Verbrauch'!K18,1)&\" %\")<6,\"+\"&ROUND('1. Prod + AH + Verbrauch'!K18,1)&\".0 %\",\"+\"&ROUND('1. Prod + AH + Verbrauch'!K18,1)&\" %\"),IF(LEN(ROUND('1. Prod + AH + Verbrauch'!K18,1)&\" %\")<6,ROUND('1. Prod + AH + Verbrauch'!K18,1)&\".0 %\",ROUND('1. Prod + AH + Verbrauch'!K18,1)&\" %\"))","v":"-0.9 %"},null,{"$f":"IF('1. Prod + AH + Verbrauch'!K42>0,IF(LEN(\"+\"&ROUND('1. Prod + AH + Verbrauch'!K42,1)&\" %\")<6,\"+\"&ROUND('1. Prod + AH + Verbrauch'!K42,1)&\".0 %\",\"+\"&ROUND('1. Prod + AH + Verbrauch'!K42,1)&\" %\"),IF(LEN(ROUND('1. Prod + AH + Verbrauch'!K42,1)&\" %\")<6,ROUND('1. Prod + AH + Verbrauch'!K42,1)&\".0 %\",ROUND('1. Prod + AH + Verbrauch'!K42,1)&\" %\"))","v":"-2.2 %"},null,null,null,null,"Ø-Bevölkerung inkl. Tourismus und Grenzgänger (2)","Ø-Bevölkerung inkl. Tourismus und Grenzgänger (2)","Ø de la population, y c. les touristes et les frontaliers (2)","Ø popolazione incl. turismo e frontalieri (2)"]
["Import",{"$f":"IF(Codierung!E30>0,IF(LEN(\"+\"&ROUND(Codierung!E30,1)&\" %\")<6,\"+\"&ROUND(Codierung!E30,1)&\".0 %\",\"+\"&ROUND(Codierung!E30,1)&\" %\"),IF(LEN(ROUND(Codierung!E30,1)&\" %\")<6,ROUND(Codierung!E30,1)&\".0 %\",ROUND(Codierung!E30,1)&\" %\"))","v":"-9.2 %"},null,{"$f":"IF('1. Prod + AH + Verbrauch'!K43>0,IF(LEN(\"+\"&ROUND('1. Prod + AH + Verbrauch'!K43,1)&\" %\")<6,\"+\"&ROUND('1. Prod + AH + Verbrauch'!K43,1)&\".0 %\",\"+\"&ROUND('1. Prod + AH + Verbrauch'!K43,1)&\" %\"),IF(LEN(ROUND('1. Prod + AH + Verbrauch'!K43,1)&\" %\")<6,ROUND('1. Prod + AH + Verbrauch'!K43,1)&\".0 %\",ROUND('1. Prod + AH + Verbrauch'!K43,1)&\" %\"))","v":"-10.3 %"},null,null,null,null,"Produktion Total","Produktion Total","Total de la production","Produzione totale"]
["Total",{"$f":"IF('1. Prod + AH + Verbrauch'!K38>0,IF(LEN(\"+\"&ROUND('1. Prod + AH + Verbrauch'!K38,1)&\" %\")<6,\"+\"&ROUND('1. Prod + AH + Verbrauch'!K38,1)&\".0 %\",\"+\"&ROUND('1. Prod + AH + Verbrauch'!K38,1)&\" %\"),IF(LEN(ROUND('1. Prod + AH + Verbrauch'!K38,1)&\" %\")<6,ROUND('1. Prod + AH + Verbrauch'!K38,1)&\".0 %\",ROUND('1. Prod + AH + Verbrauch'!K38,1)&\" %\"))","v":"-3.7 %"},null,{"$f":"IF('1. Prod + AH + Verbrauch'!K44>0,IF(LEN(\"+\"&ROUND('1. Prod + AH + Verbrauch'!K44,1)&\" %\")<6,\"+\"&ROUND('1. Prod + AH + Verbrauch'!K44,1)&\".0 %\",\"+\"&ROUND('1. Prod + AH + Verbrauch'!K44,1)&\" %\"),IF(LEN(ROUND('1. Prod + AH + Verbrauch'!K44,1)&\" %\")<6,ROUND('1. Prod + AH + Verbrauch'!K44,1)&\".0 %\",ROUND('1. Prod + AH + Verbrauch'!K44,1)&\" %\"))","v":"-4.9 %"},null,null,null,null,"Konsumeier","Konsumeier","Œufs de consommation","Uova di consumo"]
[null,null,null,null,null,null,null,null,"Verarbeitungseier","Verarbeitungseier","Œufs destinés à la transformation","Uova di trasformazione"]
[null,null,null,null,null,null,null,null,"Verarbeitung CH-Eier zu Eiprodukten (3)","Verarbeitung CH-Eier zu Eiprodukten (3)","Transformation œufs CH en ovoproduits (3)","Trasformazione uova CH in prodotti di uova (3)"]
["MEM",null,null,null,null,null,null,null,"Eiprodukte flüssig","Eiprodukte flüssig","Ovoproduits liquides","Prodotti di uova liquidi"]
[{"$f":"'3. MEM'!D24/1000","v":1961.7340879999999},{"$f":"'3. MEM'!E24/1000","v":1745.5550240000002},{"$f":"'3. MEM'!F24/1000","v":2000.0000000000011},{"$f":"'3. MEM'!G24/1000","v":2000},null,null,null,null,"Eiprodukte getrocknet","Eiprodukte getrocknet","Ovoproduits séchés","Prodotti di uova essiccati"]
[null,null,null,null,null,null,null,null,"Import","Import","Importations","Importazione"]
[null,null,null,null,null,null,null,null,"Anteil Inland","Anteil Inland","Part suisse","Quota CH"]
["Eingesetzte Mittel",{"$f":"IF('3. MEM'!J24>0,IF(LEN(\"+\"&ROUND('3. MEM'!J24,1)&\" %\")<6,\"+\"&ROUND('3. MEM'!J24,1)&\".0 %\",\"+\"&ROUND('3. MEM'!J24,1)&\" %\"),IF(LEN(ROUND('3. MEM'!J24,1)&\" %\")<6,ROUND('3. MEM'!J24,1)&\".0 %\",ROUND('3. MEM'!J24,1)&\" %\"))","v":"0.0 %"},null,null,null,null,null,null,"Anteil Import","Anteil Import","Part importée","Quota import"]
["Auslastung Mittel",{"$f":"IF('3. MEM'!J30>0,IF(LEN(\"+\"&ROUND('3. MEM'!J30,1)&\" %\")<6,\"+\"&ROUND('3. MEM'!J30,1)&\".0 %\",\"+\"&ROUND('3. MEM'!J30,1)&\" %\"),IF(LEN(ROUND('3. MEM'!J30,1)&\" %\")<6,ROUND('3. MEM'!J30,1)&\".0 %\",ROUND('3. MEM'!J30,1)&\" %\"))","v":"0.0 %"},null,null,null,null,null,null,"Inland (3)","Inland (3)","Suisse (3)","Svizzera (3)"]
["Anteil betroffene Eier an Inlandproduktion",{"$f":"IF('3. MEM'!J32>0,IF(LEN(\"+\"&ROUND('3. MEM'!J32,1)&\" %\")<6,\"+\"&ROUND('3. MEM'!J32,1)&\".0 %\",\"+\"&ROUND('3. MEM'!J32,1)&\" %\"),IF(LEN(ROUND('3. MEM'!J32,1)&\" %\")<6,ROUND('3. MEM'!J32,1)&\".0 %\",ROUND('3. MEM'!J32,1)&\" %\"))","v":"+39.3 %"},null,null,null,null,null,null,"Bruteier","Bruteier","Œufs à couver","Uova da cova"]
[null,null,null,null,null,null,null,null,"Kontingentsmenge","Kontingentsmenge","Volume du contingent tarifaire","Quantitativo di contingente"]
[null,null,null,null,null,null,null,null,"Zugeteilte / Eingeführte Menge","Zugeteilte / Eingeführte Menge","Quantité attribuée / importée","Quantitativo assegnato / importato"]
["Marktstruktur",null,null,null,null,null,null,null,"Auslastung","Auslastung","Utilisation","Grado di utilizzo"]
[null,null,null,null,null,null,null,null,0]
["LAGH",35,36,37,38,null,null,"Marktentlastungsmassnahmen","Re-Export","Re-Export","Réexportation","Riesportazione"]
[{"$f":"Codierung!$I$9","v":"Bio"},{"$f":"'D.7 MS'!$H$35","v":1.6522078241316452E-2},{"$f":"'D.7 MS'!$H$36","v":2.4473219984453863E-2},{"$f":"'D.7 MS'!$H$37","v":2.8781694406402838E-2},{"$f":"'D.7 MS'!$H$38","v":3.2512926554960166E-2},null,null,null,"Aufschlagsaktion","Aufschlagsaktion","Campagne d’œufs cassés","Azioni di spezzatura"]
[{"$f":"Codierung!$I$10","v":"Bodenhaltung"},{"$f":"'D.7 MS'!$I$35","v":0.61885807740269339},{"$f":"'D.7 MS'!$I$36","v":0.72747400192768086},{"$f":"'D.7 MS'!$I$37","v":0.59874778556405139},{"$f":"'D.7 MS'!$I$38","v":0.59918789885210133},null,null,null,"Verbilligungsaktion","Verbilligungsaktion","Campagne de ventes à prix réduits","Azioni di vendita a prezzo ridotto"]
[{"$f":"Codierung!$I$11","v":"Freilandhaltung"},{"$f":"'D.7 MS'!$J$35","v":0.35883113605338024},{"$f":"'D.7 MS'!$J$36","v":0.24770712141716664},{"$f":"'D.7 MS'!$J$37","v":0.37239816938818004},{"$f":"'D.7 MS'!$J$38","v":0.36829917459293848},null,null,null,"Eingesetzte Mittel","Eingesetzte Mittel","Moyens engagés","Fondi impiegati"]
[{"$f":"Codierung!$I$32","v":"Inland"},{"$f":"'D.7 MS'!$K$35","v":0.55395836309547952},{"$f":"'D.7 MS'!$K$36","v":0.40920752960367113},{"$f":"'D.7 MS'!$K$37","v":0.50829145964889666},{"$f":"'D.7 MS'!$K$38","v":0.5193037043423322},null,null,null,"Maximal zur Verfügung stehende Bundesmittel","Maximal zur Verfügung stehende Bundesmittel","Fonds fédéraux maximums à disposition","Disponibilità massima di fondi federali"]
[{"$f":"Codierung!$I$45","v":"Import"},{"$f":"'D.7 MS'!$L$35","v":0.44590657281609597},{"$f":"'D.7 MS'!$L$36","v":0.58896340083439258},{"$f":"'D.7 MS'!$L$37","v":0.49029777900248045},{"$f":"'D.7 MS'!$L$38","v":0.47860535874651622},null,null,null,"Auslastung Mittel","Auslastung Mittel","Charge financière","Utilizzo fondi"]
[{"$f":"Codierung!$I$95","v":"ohne Angabe"},{"$f":"'D.7 MS'!$M$35","v":1.3506408842464383E-4},{"$f":"'D.7 MS'!$M$36","v":1.8290695619362753E-3},{"$f":"'D.7 MS'!$M$37","v":1.4107613486230369E-3},{"$f":"'D.7 MS'!$M$38","v":2.0909369111515967E-3},null,null,null,"Beitrag","Beitrag","Contribution","Contributo"]
[null,null,null,null,null,null,null,null,"Anteil betroffene Eier an Inlandproduktion","Anteil betroffene Eier an Inlandproduktion","Part d’œufs concernés par rapport à la production indigène","Quota delle uova interessate rispetto alla produzione indigena"]
[null,null,null,null,null,null,null,null,0]
["Detailhandel",null,null,null,null,null,null,null,0]
[{"$f":"Codierung!$I$9","v":"Bio"},{"$f":"B69*B$73","v":0.10577630463804},{"$f":"C69*C$73","v":0.1387774732983538},0.15851537836472648,0.18238634251893371,null,null,"Produzenten- und Importpreise","Gewichteter Mittelwert","Gewichteter Mittelwert","Moyenne pondérée","Media ponderata"]
["Bodenhaltung (CH+Import)",{"$f":"B70*B$73+B72","v":0.60382767155099293},{"$f":"C70*C$73+C72","v":0.59922949397056668},0.47056648794711015,0.42019233933400701,null,null,null,"2. Klasse","2. Klasse","2e classe","II classe"]
[{"$f":"Codierung!$I$11","v":"Freilandhaltung"},{"$f":"B71*B$73","v":0.25390166714154977},0.25699441432676839,0.37091813368816312,0.39742131814705933,null,null,null,"CH gesamt","CH gesamt","CH total","Totale Svizzera"]
[null,null,null,null,null,null,null,null,"Verarbeitungseier Import","Verarbeitungseier Import","Œufs de fabrication importés","Uova di trasformazione importimportate"]
["Detailhandel","falsche Darstellung, darum umgerechnet, damit 100%",null,null,null,null,null,null,"Konsumeier Import","Konsumeier Import","Œufs de consommation importés","Uova di consumo im-porimportate"]
[{"$f":"#REF!","v":{"$error":"#REF!"}},{"$f":"'7. MS'!E40","v":0.13203095824743083},{"$f":"'7. MS'!F40","v":0.17536094885607084},{"$f":"'7. MS'!G40","v":0.23718641973012672},{"$f":"'7. MS'!H40","v":0.25748943132490687},null,null,null,"CH und Import","CH und Import","CH et importations","CH e estero"]
["Bodenhaltung (CH+Import)",{"$f":"'7. MS'!E41","v":0.50549404864133141},{"$f":"'7. MS'!F41","v":0.49358138219048603},{"$f":"'7. MS'!G41","v":0.20780910657110607},{"$f":"'7. MS'!H41","v":0.18143901149170344},null,null,null,"Produktion Inland","Produktion Inland","Production nationale","Produzione nazionale"]
[{"$f":"#REF!","v":{"$error":"#REF!"}},{"$f":"'7. MS'!E42","v":0.31692240079696743},{"$f":"'7. MS'!F42","v":0.32474135229544421},{"$f":"'7. MS'!G42","v":0.55500447369876682},{"$f":"'7. MS'!H42","v":0.56107155718338964},null,null,null,"Import","Import","Importation","Importazione"]
["Import",{"$f":"'7. MS'!E43","v":0.19885225372816479},{"$f":"'7. MS'!F43","v":0.2086181433002125},{"$f":"'7. MS'!G43","v":0.33168442550342048},{"$f":"'7. MS'!H43","v":0.29167445211064275},null,null,null,"franko Zoll","franko Zoll","franco frontière douanière","franco confine doganale"]
[null,{"$f":"1-B72","v":0.80114774627183527},{"$f":"1-C72","v":0.79138185669978744},0.66831557449657952,0.70832554788935731,null,null,null,"franko Hof","franko Hof","franco départ de l'exploitation","franco l’azienda"]
[null,null,null,null,null,null,null,null,"für Konsum","für Konsum","de consommation","di consumo"]
["Bruttowertschöpfung",null,null,null,null,null,null,null,"für Verarbeitung","für Verarbeitung","de fabrication","di trasformazione"]
[null,"Grosshandel","Detailhandel",null,null,null,null,null,"Bio (3)","Bio (3)","bio (3)","biologico (3)"]
[{"$f":"Codierung!$I$9","v":"Bio"},{"$f":"IF('8. BWS'!J38>0,IF(LEN(\"+\"&ROUND('8. BWS'!J38,1)&\" %\")<6,\"+\"&ROUND('8. BWS'!J38,1)&\".0 %\",\"+\"&ROUND('8. BWS'!J38,1)&\" %\"),IF(LEN(ROUND('8. BWS'!J38,1)&\" %\")<6,ROUND('8. BWS'!J38,1)&\".0 %\",ROUND('8. BWS'!J38,1)&\" %\"))","v":"+9.5 %"},{"$f":"IF('8. BWS'!J17>0,IF(LEN(\"+\"&ROUND('8. BWS'!J17,1)&\" %\")<6,\"+\"&ROUND('8. BWS'!J17,1)&\".0 %\",\"+\"&ROUND('8. BWS'!J17,1)&\" %\"),IF(LEN(ROUND('8. BWS'!J17,1)&\" %\")<6,ROUND('8. BWS'!J17,1)&\".0 %\",ROUND('8. BWS'!J17,1)&\" %\"))","v":"-4.1 %"},null,null,null,null,null,{"$f":"IF($I$1=\"d\",J77,IF($I$1=\"f\",K77,IF($I$1=\"i\",L77)))","v":"Freilandhaltung (2)"},"Freilandhaltung (2)","Élevage en plein air (2)","allevamento all'aperto (2)"]
[{"$f":"Codierung!$I$10","v":"Bodenhaltung"},{"$f":"IF('8. BWS'!J42>0,IF(LEN(\"+\"&ROUND('8. BWS'!J42,1)&\" %\")<6,\"+\"&ROUND('8. BWS'!J42,1)&\".0 %\",\"+\"&ROUND('8. BWS'!J42,1)&\" %\"),IF(LEN(ROUND('8. BWS'!J42,1)&\" %\")<6,ROUND('8. BWS'!J42,1)&\".0 %\",ROUND('8. BWS'!J42,1)&\" %\"))","v":"+4.0 %"},{"$f":"IF('8. BWS'!J21>0,IF(LEN(\"+\"&ROUND('8. BWS'!J21,1)&\" %\")<6,\"+\"&ROUND('8. BWS'!J21,1)&\".0 %\",\"+\"&ROUND('8. BWS'!J21,1)&\" %\"),IF(LEN(ROUND('8. BWS'!J21,1)&\" %\")<6,ROUND('8. BWS'!J21,1)&\".0 %\",ROUND('8. BWS'!J21,1)&\" %\"))","v":"-10.1 %"},null,null,null,null,"Preise im Liefer- und Abholgrosshandel","Eier frisch","Eier frisch","Œufs frais","uova crude"]
[{"$f":"Codierung!$I$11","v":"Freilandhaltung"},{"$f":"IF('8. BWS'!J46>0,IF(LEN(\"+\"&ROUND('8. BWS'!J46,1)&\" %\")<6,\"+\"&ROUND('8. BWS'!J46,1)&\".0 %\",\"+\"&ROUND('8. BWS'!J46,1)&\" %\"),IF(LEN(ROUND('8. BWS'!J46,1)&\" %\")<6,ROUND('8. BWS'!J46,1)&\".0 %\",ROUND('8. BWS'!J46,1)&\" %\"))","v":"-3.3 %"},{"$f":"IF('8. BWS'!J25>0,IF(LEN(\"+\"&ROUND('8. BWS'!J25,1)&\" %\")<6,\"+\"&ROUND('8. BWS'!J25,1)&\".0 %\",\"+\"&ROUND('8. BWS'!J25,1)&\" %\"),IF(LEN(ROUND('8. BWS'!J25,1)&\" %\")<6,ROUND('8. BWS'!J25,1)&\".0 %\",ROUND('8. BWS'!J25,1)&\" %\"))","v":"-7.5 %"},null,null,null,null,null,"Eier gekocht","Eier gekocht","Œufs cuits","uova sode"]
[{"$f":"Codierung!$I$12","v":"Inland und Import"},{"$f":"IF('8. BWS'!J50>0,IF(LEN(\"+\"&ROUND('8. BWS'!J50,1)&\" %\")<6,\"+\"&ROUND('8. BWS'!J50,1)&\".0 %\",\"+\"&ROUND('8. BWS'!J50,1)&\" %\"),IF(LEN(ROUND('8. BWS'!J50,1)&\" %\")<6,ROUND('8. BWS'!J50,1)&\".0 %\",ROUND('8. BWS'!J50,1)&\" %\"))","v":"-4.4 %"},{"$f":"IF('8. BWS'!J29>0,IF(LEN(\"+\"&ROUND('8. BWS'!J29,1)&\" %\")<6,\"+\"&ROUND('8. BWS'!J29,1)&\".0 %\",\"+\"&ROUND('8. BWS'!J29,1)&\" %\"),IF(LEN(ROUND('8. BWS'!J29,1)&\" %\")<6,ROUND('8. BWS'!J29,1)&\".0 %\",ROUND('8. BWS'!J29,1)&\" %\"))","v":"+7.5 %"},null,null,null,null,null,"Bodenhaltung Import","Bodenhaltung Import","au sol, étrangers","allevamento al suolo importate"]
[{"$f":"Codierung!$I$13","v":"Konsumeier Import"},{"$f":"IF('8. BWS'!J54>0,IF(LEN(\"+\"&ROUND('8. BWS'!J54,1)&\" %\")<6,\"+\"&ROUND('8. BWS'!J54,1)&\".0 %\",\"+\"&ROUND('8. BWS'!J54,1)&\" %\"),IF(LEN(ROUND('8. BWS'!J54,1)&\" %\")<6,ROUND('8. BWS'!J54,1)&\".0 %\",ROUND('8. BWS'!J54,1)&\" %\"))","v":"+1.2 %"},{"$f":"IF('8. BWS'!J33>0,IF(LEN(\"+\"&ROUND('8. BWS'!J33,1)&\" %\")<6,\"+\"&ROUND('8. BWS'!J33,1)&\".0 %\",\"+\"&ROUND('8. BWS'!J33,1)&\" %\"),IF(LEN(ROUND('8. BWS'!J33,1)&\" %\")<6,ROUND('8. BWS'!J33,1)&\".0 %\",ROUND('8. BWS'!J33,1)&\" %\"))","v":"-5.5 %"},null,null,null,null,null,"alle Produktionsformen CH","alle Produktionsformen CH","Tous modes de production CH","Tutti i metodi di produzione CH"]
[null,null,null,null,null,null,null,"Konsumentenpreise",{"$f":"IF($I$1=\"d\",J82,IF($I$1=\"f\",K82,IF($I$1=\"i\",L82)))","v":"Konsumentenpreise"},"Konsumentenpreise","Prix à la consommation","Prezzi al consumo "]
["LAGH",34,35,36,37,null,null,null,"4er Packung frisch","4er Packung frisch","Emballages de 4, frais","Uova crude in imballaggi da 4"]
[{"$f":"Codierung!$I$9","v":"Bio"},{"$f":"'D.8 BWS'!$X$34","v":0.22341496689199233},{"$f":"'D.8 BWS'!$X$35","v":0.29345364669906332},{"$f":"'D.8 BWS'!$X$36","v":0.27876993195615046},{"$f":"'D.8 BWS'!$X$37","v":0.27014735707361343},null,null,null,"6er Packung frisch","6er Packung frisch","Emballages de 6, frais","Uova crude in imballaggi da 6"]
[{"$f":"Codierung!$I$10","v":"Bodenhaltung"},{"$f":"'D.8 BWS'!$AB$34","v":0.20569291283025656},{"$f":"'D.8 BWS'!$AB$35","v":0.19334151854710038},{"$f":"'D.8 BWS'!$AB$36","v":0.18885483441360959},{"$f":"'D.8 BWS'!$AB$37","v":0.18206745532595628},null,null,null,"10er Packung frisch","10er Packung frisch","Emballages de 10, frais","Uova crude in imballaggi da 10"]
[{"$f":"Codierung!$I$11","v":"Freilandhaltung"},{"$f":"'D.8 BWS'!$AF$34","v":0.21767912201399586},{"$f":"'D.8 BWS'!$AF$35","v":0.34270552620213451},{"$f":"'D.8 BWS'!$AF$36","v":0.3089991271005007},{"$f":"'D.8 BWS'!$AF$37","v":0.30921526176199166},null,null,"Marktstruktur",{"$f":"IF($I$1=\"d\",J86,IF($I$1=\"f\",K86,IF($I$1=\"i\",L86)))","v":"Liefer- und Abholgrosshandel"},"Liefer- und Abholgrosshandel","Libre-service de gros","Fornitura e nell’acquisto all’ingrosso"]
[{"$f":"Codierung!$I$12","v":"Inland und Import"},{"$f":"'D.8 BWS'!$AJ$34","v":0.1803482687351409},{"$f":"'D.8 BWS'!$AJ$35","v":0.20022928095204637},{"$f":"'D.8 BWS'!$AJ$36","v":0.21629250051619339},{"$f":"'D.8 BWS'!$AJ$37","v":0.21114114836624728},null,null,null,"Detailhandel","Detailhandel","Commerce de détail","Commercio al dettaglio"]
[{"$f":"Codierung!$I$13","v":"Konsumeier Import"},{"$f":"'D.8 BWS'!$AN$34","v":0.19800297050893026},{"$f":"'D.8 BWS'!$AN$35","v":0.21191406763727835},{"$f":"'D.8 BWS'!$AN$36","v":0.2196014560863345},{"$f":"'D.8 BWS'!$AN$37","v":0.19611416686291949},null,null,null,"Detailhandel (3)","Detailhandel (3)","Commerce de détail (3)","Commercio al dettaglio (3)"]
[null,null,null,null,null,null,null,null,{"$f":"IF($I$1=\"d\",J89,IF($I$1=\"f\",K89,IF($I$1=\"i\",L89)))","v":"Detailhandel (4)"},"Detailhandel (4)","Commerce de détail (4)","Commercio al dettaglio (4)"]
[null,null,null,null,null,null,null,null,"Anteile anhand des linearen Angebots im Verkaufsregal. Die Anteile zeigen nicht die effektiven Absatzanteile (z.B. Importeier werden überschätzt). Effektive Absatzanteile lassen sich mit Absatzzahlen von NielsenIQ Switzerland berechnen.","Anteile anhand des linearen Angebots im Verkaufsregal. Die Anteile zeigen nicht die effektiven Absatzanteile (z.B. Importeier werden überschätzt). Effektive Absatzanteile lassen sich mit Absatzzahlen von NielsenIQ Switzerland berechnen.","Parts sur la base de l’offre linéaire dans les rayons. Les parts n'indiquent pas les parts de ventes effectives (par exemple, les œufs importés sont surestimés). Les parts de ventes effectives peuvent être calculées à l'aide des chiffres de vente de NielsenIQ Switzerland.","Quote sulla base dell'offerta lineare sullo scaffale. Le azioni non mostrano le quote di vendita effettive (ad esempio, le uova importate sono sopravvalutate). Le quote di vendita effettive possono essere calcolate utilizzando i dati di vendita NielsenIQ Switzerland."]
["Internationale Marktzahlen",null,null,null,null,null,null,null,"Erhebung Sammelstellen","Erhebung Sammelstellen","Relevé dans les centres de collecte","Rilevazione centri di raccolta"]
["M/L (Mittelwert)",{"$f":"Codierung!$I$252&'D.9 Int.'!$A$18&\"-\"&'D.9 Int.'!$A$22","v":"Ø 2006-2010"},{"$f":"'9. Int.'!F12","v":2021},{"$f":"'9. Int.'!G12","v":2022},null,null,null,null,"Produktion Total (aus Kükenstatistik)","Produktion Total (aus Kükenstatistik)","Total de la production (à partir de la statistique des poussins)","Produzione totale (dalla statistica sui pulcini)"]
["Österreich",null,{"$f":"'9. Int.'!F12","v":2021},{"$f":"'9. Int.'!G12","v":2022},null,null,null,null,"Abdeckung durch Erhebung (2)","Abdeckung durch Erhebung (2)","Couverture par les relevés (2)","Copertura tramite rilevazione (2)"]
[{"$f":"Codierung!$I$9","v":"Bio"},{"$f":"AVERAGE('9. Int.'!E24:E26)","v":0.19220719696969696},{"$f":"AVERAGE('9. Int.'!F25:F26)","v":0.27642500000000003},{"$f":"AVERAGE('9. Int.'!G25:G26)","v":0.31697916666666665},{"$f":"IFERROR((D94-C94)/C94*100,\"-\")","v":14.670947514395083},{"$f":"IF(Codierung!E94>0,IF(LEN(\"+\"&ROUND(Codierung!E94,1)&\" %\")<6,\"+\"&ROUND(Codierung!E94,1)&\".0 %\",\"+\"&ROUND(Codierung!E94,1)&\" %\"),IF(LEN(ROUND(Codierung!E94,1)&\" %\")<6,ROUND(Codierung!E94,1)&\".0 %\",ROUND(Codierung!E94,1)&\" %\"))","v":"+14.7 %"},null,null,"Boden- und Freilandhaltung","Boden- und Freilandhaltung","Élevage au sol et en plein air","Allevamento al suolo e all'aperto estensivo"]
[{"$f":"Codierung!$I$10","v":"Bodenhaltung"},{"$f":"AVERAGE('9. Int.'!E28:E29)","v":9.6234166666666676E-2},{"$f":"AVERAGE('9. Int.'!F28:F29)","v":0.11984583333333333},{"$f":"AVERAGE('9. Int.'!G28:G29)","v":0.158725},{"$f":"IFERROR((D95-C95)/C95*100,\"-\")","v":32.440983207593092},{"$f":"IF(Codierung!E95>0,IF(LEN(\"+\"&ROUND(Codierung!E95,1)&\" %\")<6,\"+\"&ROUND(Codierung!E95,1)&\".0 %\",\"+\"&ROUND(Codierung!E95,1)&\" %\"),IF(LEN(ROUND(Codierung!E95,1)&\" %\")<6,ROUND(Codierung!E95,1)&\".0 %\",ROUND(Codierung!E95,1)&\" %\"))","v":"+32.4 %"},null,null,"ohne Angabe","ohne Angabe","sans indication","senza indicazione"]
[{"$f":"Codierung!$I$11","v":"Freilandhaltung"},{"$f":"AVERAGE('9. Int.'!E31:E32)","v":0.12651562499999999},{"$f":"AVERAGE('9. Int.'!F31:F32)","v":0.17055833333333331},{"$f":"AVERAGE('9. Int.'!G31:G32)","v":0.2228},30.629794303024394,{"$f":"IF(Codierung!E96>0,IF(LEN(\"+\"&ROUND(Codierung!E96,1)&\" %\")<6,\"+\"&ROUND(Codierung!E96,1)&\".0 %\",\"+\"&ROUND(Codierung!E96,1)&\" %\"),IF(LEN(ROUND(Codierung!E96,1)&\" %\")<6,ROUND(Codierung!E96,1)&\".0 %\",ROUND(Codierung!E96,1)&\" %\"))","v":"+30.6 %"},null,null,"Anteil nach Produktionsform","Anteil nach Produktionsform","Part selon le mode de production","Quota secondo il metodo di produzione"]
[null,null,null,null,null,null,null,null,"Anteil nach Herkunft","Anteil nach Herkunft","Part selon la provenance","Quota secondo la provenienza"]
["Deutschland",null,null,null,null,null,null,null,"Anteil Inland","Anteil Inland","Suisse","CH"]
[{"$f":"Codierung!$I$10","v":"Bodenhaltung"},{"$f":"AVERAGE('9. Int.'!E16:E17)","v":8.1515782828282826E-2},{"$f":"AVERAGE('9. Int.'!F16:F17)","v":7.1545833333333336E-2},{"$f":"AVERAGE('9. Int.'!G16:G17)","v":0.11480416666666667},{"$f":"IFERROR((D99-C99)/C99*100,\"-\")","v":60.462407547609331},{"$f":"IF(Codierung!E99>0,IF(LEN(\"+\"&ROUND(Codierung!E99,1)&\" %\")<6,\"+\"&ROUND(Codierung!E99,1)&\".0 %\",\"+\"&ROUND(Codierung!E99,1)&\" %\"),IF(LEN(ROUND(Codierung!E99,1)&\" %\")<6,ROUND(Codierung!E99,1)&\".0 %\",ROUND(Codierung!E99,1)&\" %\"))","v":"+60.5 %"},null,null,"Anteil Import","Anteil Import","Importation","Estero"]
[null,null,null,null,null,null,null,null,"Absätze anhand NielsenIQ Switzerland, Total Market Consumer/Retail Panel; Kalkulation Fachbereich Marktanalysen BLW","Absätze anhand NielsenIQ Switzerland, Total Market Consumer/Retail Panel; Kalkulation Fachbereich Marktanalysen BLW","Ventes sur la base des données communiquées par NielsenIQ Switzerland, Total Market Consumer/Retail Panel; Calcul par le secteur Analyses du marché OFAG","Vendite sulla base dei dati di NielsenIQ Switzerland, Total Market Consumer/Retail Panel; calcolo Settore Analisi del mercato UFAG"]
[{"$f":"Codierung!$I$113","v":"Bio (M) 10er Packung"},null,null,{"$f":"IF('9. Int.'!I35>0,IF(LEN(\"+\"&ROUND('9. Int.'!I35,1)&\" %\")<6,\"+\"&ROUND('9. Int.'!I35,1)&\".0 %\",\"+\"&ROUND('9. Int.'!I35,1)&\" %\"),IF(LEN(ROUND('9. Int.'!I35,1)&\" %\")<6,ROUND('9. Int.'!I35,1)&\".0 %\",ROUND('9. Int.'!I35,1)&\" %\"))","v":"+5.6 %"},null,null,null,null,"Importeier","Importeier","Oeufs importés","Uova importate"]
[{"$f":"Codierung!$I$114","v":"Bodenhaltung (M) 10er Packung"},null,null,{"$f":"IF('9. Int.'!I36>0,IF(LEN(\"+\"&ROUND('9. Int.'!I36,1)&\" %\")<6,\"+\"&ROUND('9. Int.'!I36,1)&\".0 %\",\"+\"&ROUND('9. Int.'!I36,1)&\" %\"),IF(LEN(ROUND('9. Int.'!I36,1)&\" %\")<6,ROUND('9. Int.'!I36,1)&\".0 %\",ROUND('9. Int.'!I36,1)&\" %\"))","v":"+25.0 %"}]
[{"$f":"Codierung!$I$115","v":"Freilandhaltung (M) 10er Packung"},null,null,{"$f":"IF('9. Int.'!I37>0,IF(LEN(\"+\"&ROUND('9. Int.'!I37,1)&\" %\")<6,\"+\"&ROUND('9. Int.'!I37,1)&\".0 %\",\"+\"&ROUND('9. Int.'!I37,1)&\" %\"),IF(LEN(ROUND('9. Int.'!I37,1)&\" %\")<6,ROUND('9. Int.'!I37,1)&\".0 %\",ROUND('9. Int.'!I37,1)&\" %\"))","v":"+12.7 %"},null,null,null,"International",{"$f":"IF($I$1=\"d\",J103,IF($I$1=\"f\",K103,IF($I$1=\"i\",L103)))","v":"Konsumentenpreise International"},"Konsumentenpreise International","Prix à la consommation internationales","Prezzi consumo internazionali"]
[{"$f":"Codierung!$I$110","v":"Bio (M) 4er und 6er Packung"},null,null,{"$f":"IF('9. Int.'!I39>0,IF(LEN(\"+\"&ROUND('9. Int.'!I39,1)&\" %\")<6,\"+\"&ROUND('9. Int.'!I39,1)&\".0 %\",\"+\"&ROUND('9. Int.'!I39,1)&\" %\"),IF(LEN(ROUND('9. Int.'!I39,1)&\" %\")<6,ROUND('9. Int.'!I39,1)&\".0 %\",ROUND('9. Int.'!I39,1)&\" %\"))","v":"+7.8 %"},null,null,null,null,"Produzentenpreise International","Produzentenpreise International","Prix à la production internationales","Prezzi alla produzione internazionali"]
[{"$f":"Codierung!$I$111","v":"Bodenhaltung (M) 6er und 10er Pack."},null,null,{"$f":"IF('9. Int.'!I40>0,IF(LEN(\"+\"&ROUND('9. Int.'!I40,1)&\" %\")<6,\"+\"&ROUND('9. Int.'!I40,1)&\".0 %\",\"+\"&ROUND('9. Int.'!I40,1)&\" %\"),IF(LEN(ROUND('9. Int.'!I40,1)&\" %\")<6,ROUND('9. Int.'!I40,1)&\".0 %\",ROUND('9. Int.'!I40,1)&\" %\"))","v":"+25.2 %"},null,null,null,null,"Pro-Kopf-Verbrauch International","Pro-Kopf-Verbrauch International","Consommation par habitant internationales","Consumo pro capite internazionale"]
[{"$f":"Codierung!$I$112","v":"Freilandhaltung (M) 6er und 10er Pack."},null,null,{"$f":"IF('9. Int.'!I41>0,IF(LEN(\"+\"&ROUND('9. Int.'!I41,1)&\" %\")<6,\"+\"&ROUND('9. Int.'!I41,1)&\".0 %\",\"+\"&ROUND('9. Int.'!I41,1)&\" %\"),IF(LEN(ROUND('9. Int.'!I41,1)&\" %\")<6,ROUND('9. Int.'!I41,1)&\".0 %\",ROUND('9. Int.'!I41,1)&\" %\"))","v":"+4.3 %"},null,null,null,null,"10er Packungen","10er Packungen","Emballage de 10","Imballaggi da 10"]
[null,null,null,null,null,null,null,null,"6er und 10er Packungen","6er und 10er Packungen","Emballage de 6 et de 10","Imballaggi da 6 e da 10"]
[null,null,null,null,null,null,null,null,"Preise lose ab Station","Preise lose ab Station","Prix au départ du centre d'emballage","Prezzi a partire da centro di imballaggio"]
["Pro-Kopf-Verbrauch",{"$f":"Codierung!$I$252&'D.9 Int.'!$A$18&\"-\"&'D.9 Int.'!$A$22","v":"Ø 2006-2010"},{"$f":"'9. Int.'!F12","v":2021},null,null,null,null,null,"Bio (M) 6er und 10er Packung","Bio (M) 6er und 10er Packung","Bio (M), par 6 et 10","Biologiche (M) imballaggi da 6 e da 10"]
[{"$f":"Codierung!$I$187","v":"Schweiz"},{"$f":"'1. Prod + AH + Verbrauch'!F44","v":174.96521314975229},{"$f":"'9. Int.'!F43","v":195.16464580369126},{"$f":"(C110/B110-1)*100","v":11.544827849093831},{"$f":"IFERROR(IF(Codierung!D110>0,IF(LEN(\"+\"&ROUND(Codierung!D110,1)&\" %\")<6,\"+\"&ROUND(Codierung!D110,1)&\".0 %\",\"+\"&ROUND(Codierung!D110,1)&\" %\"),IF(LEN(ROUND(Codierung!D110,1)&\" %\")<6,ROUND(Codierung!D110,1)&\".0 %\",ROUND(Codierung!D110,1)&\" %\")),\"-\")","v":"+11.5 %"},null,null,null,"Bio (M) 4er und 6er Packung","Bio (M) 4er und 6er Packung","Bio (M), par 4 et 6","Biologiche (M) imballaggi da 4 e da 6"]
[{"$f":"Codierung!$I$188","v":"Deutschland"},{"$f":"AVERAGE('D.9 Int.'!$AB$18:$AB$22)","v":210},{"$f":"'9. Int.'!F44","v":237.50800769971121},13.099051285576779,{"$f":"IFERROR(IF(Codierung!D111>0,IF(LEN(\"+\"&ROUND(Codierung!D111,1)&\" %\")<6,\"+\"&ROUND(Codierung!D111,1)&\".0 %\",\"+\"&ROUND(Codierung!D111,1)&\" %\"),IF(LEN(ROUND(Codierung!D111,1)&\" %\")<6,ROUND(Codierung!D111,1)&\".0 %\",ROUND(Codierung!D111,1)&\" %\")),\"-\")","v":"+13.1 %"},null,null,null,"Bodenhaltung (M) 6er und 10er Pack.","Bodenhaltung (M) 6er und 10er Pack.","Elevage au sol (M), par 6 et 10","Allevamento al suolo (M) imballaggi da 6 e da 10"]
[{"$f":"Codierung!$I$190","v":"Österreich"},{"$f":"AVERAGE('D.9 Int.'!$AC$18:$AC$22)","v":234.89027000525954},{"$f":"'9. Int.'!F45","v":233},-0.80474597999193875,{"$f":"IFERROR(IF(Codierung!D112>0,IF(LEN(\"+\"&ROUND(Codierung!D112,1)&\" %\")<6,\"+\"&ROUND(Codierung!D112,1)&\".0 %\",\"+\"&ROUND(Codierung!D112,1)&\" %\"),IF(LEN(ROUND(Codierung!D112,1)&\" %\")<6,ROUND(Codierung!D112,1)&\".0 %\",ROUND(Codierung!D112,1)&\" %\")),\"-\")","v":"-0.8 %"},null,null,null,"Freilandhaltung (M) 6er und 10er Pack.","Freilandhaltung (M) 6er und 10er Pack.","Plein air (M), par 6 et 10","Allevamento all'aperto estensivo (M) imballaggi da 6 e da 10"]
[{"$f":"Codierung!$I$195","v":"EU-15"},{"$f":"AVERAGE('D.9 Int.'!$AD$18:$AD$22)","v":223.51556844082384},{"$f":"'9. Int.'!F46","v":229.291042762128},2.5839248521219771,{"$f":"IFERROR(IF(Codierung!D113>0,IF(LEN(\"+\"&ROUND(Codierung!D113,1)&\" %\")<6,\"+\"&ROUND(Codierung!D113,1)&\".0 %\",\"+\"&ROUND(Codierung!D113,1)&\" %\"),IF(LEN(ROUND(Codierung!D113,1)&\" %\")<6,ROUND(Codierung!D113,1)&\".0 %\",ROUND(Codierung!D113,1)&\" %\")),\"-\")","v":"+2.6 %"},null,null,null,"Bio (M) 10er Packung","Bio (M) 10er Packung","Bio (M), par 10","Biologiche (M) imballaggi da 10"]
[{"$f":"Codierung!$I$196","v":"USA"},{"$f":"AVERAGE('D.9 Int.'!$AE$18:$AE$22)","v":246.91014955155893},{"$f":"'9. Int.'!F47","v":280.49380000000002},13.601567416096948,{"$f":"IFERROR(IF(Codierung!D114>0,IF(LEN(\"+\"&ROUND(Codierung!D114,1)&\" %\")<6,\"+\"&ROUND(Codierung!D114,1)&\".0 %\",\"+\"&ROUND(Codierung!D114,1)&\" %\"),IF(LEN(ROUND(Codierung!D114,1)&\" %\")<6,ROUND(Codierung!D114,1)&\".0 %\",ROUND(Codierung!D114,1)&\" %\")),\"-\")","v":"+13.6 %"},null,null,null,"Bodenhaltung (M) 10er Packung","Bodenhaltung (M) 10er Packung","Elevage au sol (M), par 10","Allevamento al suolo (M) imballaggi da 10"]
[{"$f":"Codierung!$I$197","v":"Singapur"},{"$f":"AVERAGE('D.9 Int.'!$AF$18:$AF$22)","v":299.60000000000002},{"$f":"'9. Int.'!F48","v":390},30.173564753003991,{"$f":"IFERROR(IF(Codierung!D115>0,IF(LEN(\"+\"&ROUND(Codierung!D115,1)&\" %\")<6,\"+\"&ROUND(Codierung!D115,1)&\".0 %\",\"+\"&ROUND(Codierung!D115,1)&\" %\"),IF(LEN(ROUND(Codierung!D115,1)&\" %\")<6,ROUND(Codierung!D115,1)&\".0 %\",ROUND(Codierung!D115,1)&\" %\")),\"-\")","v":"+30.2 %"},null,null,null,"Freilandhaltung (M) 10er Packung","Freilandhaltung (M) 10er Packung","Plein air (M), par 10","Allevamento all'aperto estensivo (M) imballaggi da 10"]
[null,null,null,null,null,null,null,null,{"$f":"IF($I$1=\"d\",J116,IF($I$1=\"f\",K116,IF($I$1=\"i\",L116)))","v":"Produzentenpreise"},"Produzentenpreise","Prix à la production","Prezzi alla produzione"]
[null,null,null,null,null,null,null,null,"M, 6er und 10er Packung","M, 6er und 10er Packung","M, par 6 et 10","M, imballaggi da 6 e da 10"]
[null,null,null,null,null,null,null,null,"M, 4er und 6er Packung","M, 4er und 6er Packung","M, par 4 et 6","M, imballaggi da 4 e da 6"]
[{"$f":"Codierung!$I$171&\" - \"&Codierung!$I$40","v":"Importe nach Herkunft - Konsumeier"},{"$f":"'2.1 Imp.n.H.'!E13","v":2021},{"$f":"'2.1 Imp.n.H.'!F13","v":2022},null,null,null,null,null,"M, 10er Packung","M, 10er Packung","M, par 10","M, imballaggi da 10"]
[{"$f":"'2.1 Imp.n.H.'!B18","v":"Polen"},{"$f":"'2.1 Imp.n.H.'!E18","v":7.1218614800000006},{"$f":"'2.1 Imp.n.H.'!F18","v":2.5209477120000003},{"$f":"(C120/B120-1)*100","v":-64.602685420385342},{"$f":"IFERROR(IF(Codierung!D120>0,IF(LEN(\"+\"&ROUND(Codierung!D120,1)&\" %\")<6,\"+\"&ROUND(Codierung!D120,1)&\".0 %\",\"+\"&ROUND(Codierung!D120,1)&\" %\"),IF(LEN(ROUND(Codierung!D120,1)&\" %\")<6,ROUND(Codierung!D120,1)&\".0 %\",ROUND(Codierung!D120,1)&\" %\")),\"-\")","v":"-64.6 %"},null,null,null,"Wechselkurs CHF/Euro","Wechselkurs CHF/Euro","Taux de change CHF/euro","Corso del cambio CHF/euro"]
[{"$f":"'2.1 Imp.n.H.'!B20","v":"Rest"},{"$f":"'2.1 Imp.n.H.'!E20","v":15.286069512599946},{"$f":"'2.1 Imp.n.H.'!F20","v":12.490064996399969},{"$f":"(C121/B121-1)*100","v":-18.29119325864178},{"$f":"IFERROR(IF(Codierung!D121>0,IF(LEN(\"+\"&ROUND(Codierung!D121,1)&\" %\")<6,\"+\"&ROUND(Codierung!D121,1)&\".0 %\",\"+\"&ROUND(Codierung!D121,1)&\" %\"),IF(LEN(ROUND(Codierung!D121,1)&\" %\")<6,ROUND(Codierung!D121,1)&\".0 %\",ROUND(Codierung!D121,1)&\" %\")),\"-\")","v":"-18.3 %"}]
[{"$f":"'2.1 Imp.n.H.'!B17","v":"Frankreich"},{"$f":"'2.1 Imp.n.H.'!E17","v":21.469935243800002},{"$f":"'2.1 Imp.n.H.'!F17","v":21.142318722799999},{"$f":"(C122/B122-1)*100","v":-1.5259315749199143},{"$f":"IFERROR(IF(Codierung!D122>0,IF(LEN(\"+\"&ROUND(Codierung!D122,1)&\" %\")<6,\"+\"&ROUND(Codierung!D122,1)&\".0 %\",\"+\"&ROUND(Codierung!D122,1)&\" %\"),IF(LEN(ROUND(Codierung!D122,1)&\" %\")<6,ROUND(Codierung!D122,1)&\".0 %\",ROUND(Codierung!D122,1)&\" %\")),\"-\")","v":"-1.5 %"}]
[{"$f":"'2.1 Imp.n.H.'!B19","v":"Italien"},{"$f":"'2.1 Imp.n.H.'!E19","v":1.6653717932000001},{"$f":"'2.1 Imp.n.H.'!F19","v":1.5101846182000003},{"$f":"(C123/B123-1)*100","v":-9.3184702439212508},{"$f":"IFERROR(IF(Codierung!D123>0,IF(LEN(\"+\"&ROUND(Codierung!D123,1)&\" %\")<6,\"+\"&ROUND(Codierung!D123,1)&\".0 %\",\"+\"&ROUND(Codierung!D123,1)&\" %\"),IF(LEN(ROUND(Codierung!D123,1)&\" %\")<6,ROUND(Codierung!D123,1)&\".0 %\",ROUND(Codierung!D123,1)&\" %\")),\"-\")","v":"-9.3 %"}]
[{"$f":"'2.1 Imp.n.H.'!B16","v":"Deutschland"},{"$f":"'2.1 Imp.n.H.'!E16","v":67.609911999000005},{"$f":"'2.1 Imp.n.H.'!F16","v":17.485907222999998},-74.13706554852692,{"$f":"IFERROR(IF(Codierung!D124>0,IF(LEN(\"+\"&ROUND(Codierung!D124,1)&\" %\")<6,\"+\"&ROUND(Codierung!D124,1)&\".0 %\",\"+\"&ROUND(Codierung!D124,1)&\" %\"),IF(LEN(ROUND(Codierung!D124,1)&\" %\")<6,ROUND(Codierung!D124,1)&\".0 %\",ROUND(Codierung!D124,1)&\" %\")),\"-\")","v":"-74.1 %"},null,null,"Inhaltsverzeichnis",{"$f":"IF($I$1=\"d\",J124,IF($I$1=\"f\",K124,IF($I$1=\"i\",L124)))","v":"Marktbericht: "},"Marktbericht: ","Bulletin du marché:","Rapporto sul mercato:"]
[{"$f":"'2.1 Imp.n.H.'!B15","v":"Niederlande"},{"$f":"'2.1 Imp.n.H.'!E15","v":173.23588107000003},{"$f":"'2.1 Imp.n.H.'!F15","v":209.75133482799995},21.078458765274497,{"$f":"IFERROR(IF(Codierung!D125>0,IF(LEN(\"+\"&ROUND(Codierung!D125,1)&\" %\")<6,\"+\"&ROUND(Codierung!D125,1)&\".0 %\",\"+\"&ROUND(Codierung!D125,1)&\" %\"),IF(LEN(ROUND(Codierung!D125,1)&\" %\")<6,ROUND(Codierung!D125,1)&\".0 %\",ROUND(Codierung!D125,1)&\" %\")),\"-\")","v":"+21.1 %"},null,null,null,"Inhaltsverzeichnis","Inhaltsverzeichnis","Table des matières","Contenuto"]
[null,null,null,null,null,null,null,null,"Inhalt + Front Story","Inhalt + Front Story","Contenu + Front Story","Indice + Front Story"]
[{"$f":"Codierung!$I$171&\" - \"&Codierung!$I$41","v":"Importe nach Herkunft - Verarbeitungseier"},{"$f":"'2.1 Imp.n.H.'!E13","v":2021},{"$f":"'2.1 Imp.n.H.'!F13","v":2022},null,null,null,null,null,"1. Produktion, Aussenhandel und Verbrauch (Prod + AH + Verbrauch)","1. Produktion, Aussenhandel und Verbrauch (Prod + AH + Verbrauch)","1. Production, commerce extérieur et consommation (Prod + AH + Verbrauch)","1. Produzione, commercio estero e consumo (Prod + AH + Verbrauch)"]
[{"$f":"'2.1 Imp.n.H.'!B26","v":"Polen"},{"$f":"'2.1 Imp.n.H.'!E26","v":0},{"$f":"'2.1 Imp.n.H.'!F26","v":0.3331288},{"$f":"(C128/B128-1)*100","v":{"$error":"#DIV/0!"}},{"$f":"IFERROR(IF(Codierung!D128>0,IF(LEN(\"+\"&ROUND(Codierung!D128,1)&\" %\")<6,\"+\"&ROUND(Codierung!D128,1)&\".0 %\",\"+\"&ROUND(Codierung!D128,1)&\" %\"),IF(LEN(ROUND(Codierung!D128,1)&\" %\")<6,ROUND(Codierung!D128,1)&\".0 %\",ROUND(Codierung!D128,1)&\" %\")),\"-\")","v":"-"},null,null,null,"2.1 Import nach Herkunft (Imp.n.H.)","2.1 Import nach Herkunft (Imp.n.H.)","2.1 Importation par origine (imp.p.o.)","2.1 Importazioni per provenienza (Imp.n.H.)"]
[{"$f":"'2.1 Imp.n.H.'!B25","v":"Frankreich"},{"$f":"'2.1 Imp.n.H.'!E25","v":0.12974560000000002},{"$f":"'2.1 Imp.n.H.'!F25","v":0},{"$f":"(C129/B129-1)*100","v":-100},{"$f":"IFERROR(IF(Codierung!D129>0,IF(LEN(\"+\"&ROUND(Codierung!D129,1)&\" %\")<6,\"+\"&ROUND(Codierung!D129,1)&\".0 %\",\"+\"&ROUND(Codierung!D129,1)&\" %\"),IF(LEN(ROUND(Codierung!D129,1)&\" %\")<6,ROUND(Codierung!D129,1)&\".0 %\",ROUND(Codierung!D129,1)&\" %\")),\"-\")","v":"-100 %"},null,null,null,"2.2 Auslastung der Importkontingente (Imp.n.Kont.)","2.2 Auslastung der Importkontingente (Imp.n.Kont.)","2.2. Utilisation des contingents d'importation (imp.p.c.)","2.2 Grado di utilizzo dei contingenti d'importazione (Imp.n.Kont.)"]
[{"$f":"'2.1 Imp.n.H.'!B24","v":"Bulgarien"},{"$f":"'2.1 Imp.n.H.'!E24","v":20.377739953599995},{"$f":"'2.1 Imp.n.H.'!F24","v":5.7816807319999999},{"$f":"(C130/B130-1)*100","v":-71.627468280757057},{"$f":"IFERROR(IF(Codierung!D130>0,IF(LEN(\"+\"&ROUND(Codierung!D130,1)&\" %\")<6,\"+\"&ROUND(Codierung!D130,1)&\".0 %\",\"+\"&ROUND(Codierung!D130,1)&\" %\"),IF(LEN(ROUND(Codierung!D130,1)&\" %\")<6,ROUND(Codierung!D130,1)&\".0 %\",ROUND(Codierung!D130,1)&\" %\")),\"-\")","v":"-71.6 %"},null,null,null,"2.3 Aktiver Veredelungsverkehr (aVV)","2.3 Aktiver Veredelungsverkehr (aVV)","2. Trafic de perfectionnement actif (aVV)","2. Traffico di perfezionamento attivo (aVV)"]
[{"$f":"'2.1 Imp.n.H.'!B27","v":"Rest"},{"$f":"'2.1 Imp.n.H.'!E27","v":16.048795837999954},{"$f":"'2.1 Imp.n.H.'!F27","v":17.942019861999988},11.796673364847132,{"$f":"IFERROR(IF(Codierung!D131>0,IF(LEN(\"+\"&ROUND(Codierung!D131,1)&\" %\")<6,\"+\"&ROUND(Codierung!D131,1)&\".0 %\",\"+\"&ROUND(Codierung!D131,1)&\" %\"),IF(LEN(ROUND(Codierung!D131,1)&\" %\")<6,ROUND(Codierung!D131,1)&\".0 %\",ROUND(Codierung!D131,1)&\" %\")),\"-\")","v":"+11.8 %"},null,null,null,"2.4 \"Versteckte\" Eierimporte in Lebensmittelzubereitungen (Imp. LM): Inoffizielle Schätzung",{"$f":"\"2.4 \"&J157&\" (Imp. LM): \"&J261","v":"2.4 \"Versteckte\" Eierimporte in Lebensmittelzubereitungen (Imp. LM): Inoffizielle Schätzung"},{"$f":"\"2.4 \"&K157&\" (Imp. LM): \"&K261","v":"2.4 Importations d'œufs \"cachées\" dans les préparations alimentaires (Imp. LM): Estimation non officielle"},"2.4 Importazioni di uova «nascoste» nelle preparazioni alimentari (Imp. LM): Stima non ufficiale"]
[{"$f":"'2.1 Imp.n.H.'!B23","v":"Deutschland"},{"$f":"'2.1 Imp.n.H.'!E23","v":21.298206201999999},{"$f":"'2.1 Imp.n.H.'!F23","v":17.284226602},-18.846561827460697,{"$f":"IFERROR(IF(Codierung!D132>0,IF(LEN(\"+\"&ROUND(Codierung!D132,1)&\" %\")<6,\"+\"&ROUND(Codierung!D132,1)&\".0 %\",\"+\"&ROUND(Codierung!D132,1)&\" %\"),IF(LEN(ROUND(Codierung!D132,1)&\" %\")<6,ROUND(Codierung!D132,1)&\".0 %\",ROUND(Codierung!D132,1)&\" %\")),\"-\")","v":"-18.8 %"},null,null,null,"3. Marktentlastungsmassnahmen (MEM)","3. Marktentlastungsmassnahmen (MEM)","3. Mesures d’allégement du marché (MEM)","3. Provvedimenti di sgravio del mercato (MEM)"]
[{"$f":"'2.1 Imp.n.H.'!B22","v":"Niederlande"},{"$f":"'2.1 Imp.n.H.'!E22","v":68.594451939999999},{"$f":"'2.1 Imp.n.H.'!F22","v":52.822893200000003},-22.992469935900171,{"$f":"IFERROR(IF(Codierung!D133>0,IF(LEN(\"+\"&ROUND(Codierung!D133,1)&\" %\")<6,\"+\"&ROUND(Codierung!D133,1)&\".0 %\",\"+\"&ROUND(Codierung!D133,1)&\" %\"),IF(LEN(ROUND(Codierung!D133,1)&\" %\")<6,ROUND(Codierung!D133,1)&\".0 %\",ROUND(Codierung!D133,1)&\" %\")),\"-\")","v":"-23.0 %"},null,null,null,"4. Produzenten- und Importpreise (PP)","4. Produzenten- und Importpreise (PP)","4. Prix à la production et à l'importation (PP)","4. Prezzi alla produzione e all'importazione (PP)"]
[null,null,null,null,null,null,null,null,"5. Preise im Liefer- und Abholgrosshandel (GHP)","5. Preise im Liefer- und Abholgrosshandel (GHP)","5. Prix dans le libre-service de gros (GHP)","5. Prezzi nella fornitura e nell’acquisto all’ingrosso (GHP)"]
[null,null,null,null,null,null,null,null,"6. Konsumentenpreise (KP)","6. Konsumentenpreise (KP)","6. Prix de consommation actuels (KP)","6. Prezzi al consumo attuali (KP)"]
[{"$f":"Codierung!$I$171&\" - \"&Codierung!$I$37","v":"Importe nach Herkunft - Eiprodukte"},{"$f":"'2.1 Imp.n.H.'!E13","v":2021},{"$f":"'2.1 Imp.n.H.'!F13","v":2022},null,null,null,null,null,"7. Marktstruktur (MS)","7. Marktstruktur (MS)","7. Structure du marché (MS)","7. Struttura del mercato (MS)"]
[{"$f":"'2.1 Imp.n.H.'!B32","v":"Belgien"},{"$f":"'2.1 Imp.n.H.'!E32","v":7.0935831783599994},{"$f":"'2.1 Imp.n.H.'!F32","v":8.2894482467999993},{"$f":"(C137/B137-1)*100","v":16.858406229564761},{"$f":"IFERROR(IF(Codierung!D137>0,IF(LEN(\"+\"&ROUND(Codierung!D137,1)&\" %\")<6,\"+\"&ROUND(Codierung!D137,1)&\".0 %\",\"+\"&ROUND(Codierung!D137,1)&\" %\"),IF(LEN(ROUND(Codierung!D137,1)&\" %\")<6,ROUND(Codierung!D137,1)&\".0 %\",ROUND(Codierung!D137,1)&\" %\")),\"-\")","v":"+16.9 %"},null,null,null,"8. Bruttowertschöpfung (BWS)","8. Bruttowertschöpfung (BWS)","8. Valeurs ajoutées brutes (Bruttowertschöpfung (BWS))","8. Valori aggiunti lordi (Bruttowertschöpfung (BWS))"]
[{"$f":"'2.1 Imp.n.H.'!B34","v":"Rest"},{"$f":"'2.1 Imp.n.H.'!E34","v":5.7168061331999303},{"$f":"'2.1 Imp.n.H.'!F34","v":5.3523848980398476},{"$f":"(C138/B138-1)*100","v":-6.3745599670370741},{"$f":"IFERROR(IF(Codierung!D138>0,IF(LEN(\"+\"&ROUND(Codierung!D138,1)&\" %\")<6,\"+\"&ROUND(Codierung!D138,1)&\".0 %\",\"+\"&ROUND(Codierung!D138,1)&\" %\"),IF(LEN(ROUND(Codierung!D138,1)&\" %\")<6,ROUND(Codierung!D138,1)&\".0 %\",ROUND(Codierung!D138,1)&\" %\")),\"-\")","v":"-6.4 %"},null,null,null,"9. International (Int.)","9. International (Int.)","9. International (Int.)","9. Internazionale (Int.)"]
[{"$f":"'2.1 Imp.n.H.'!B31","v":"Italien"},{"$f":"'2.1 Imp.n.H.'!E31","v":10.054078289879998},{"$f":"'2.1 Imp.n.H.'!F31","v":6.2798839704000002},{"$f":"(C139/B139-1)*100","v":-37.538939032123309},{"$f":"IFERROR(IF(Codierung!D139>0,IF(LEN(\"+\"&ROUND(Codierung!D139,1)&\" %\")<6,\"+\"&ROUND(Codierung!D139,1)&\".0 %\",\"+\"&ROUND(Codierung!D139,1)&\" %\"),IF(LEN(ROUND(Codierung!D139,1)&\" %\")<6,ROUND(Codierung!D139,1)&\".0 %\",ROUND(Codierung!D139,1)&\" %\")),\"-\")","v":"-37.5 %"},null,null,null,"Datenreihen: ","Datenreihen: ","Séries de données:","Serie di dati:"]
[{"$f":"'2.1 Imp.n.H.'!B33","v":"Frankreich"},{"$f":"'2.1 Imp.n.H.'!E33","v":12.30479053024},{"$f":"'2.1 Imp.n.H.'!F33","v":12.897572374660001},{"$f":"(C140/B140-1)*100","v":4.8174883023257786},{"$f":"IFERROR(IF(Codierung!D140>0,IF(LEN(\"+\"&ROUND(Codierung!D140,1)&\" %\")<6,\"+\"&ROUND(Codierung!D140,1)&\".0 %\",\"+\"&ROUND(Codierung!D140,1)&\" %\"),IF(LEN(ROUND(Codierung!D140,1)&\" %\")<6,ROUND(Codierung!D140,1)&\".0 %\",ROUND(Codierung!D140,1)&\" %\")),\"-\")","v":"+4.8 %"},null,null,null,"D.1 Prod + AH + Verbrauch","D.1 Prod + AH + Verbrauch","D.1 Prod + AH + Verbrauch","D.1 Prod + AH + Verbrauch"]
[{"$f":"'2.1 Imp.n.H.'!B30","v":"Deutschland"},{"$f":"'2.1 Imp.n.H.'!E30","v":44.041592995999991},{"$f":"'2.1 Imp.n.H.'!F30","v":48.639495346899992},10.439909272395287,{"$f":"IFERROR(IF(Codierung!D141>0,IF(LEN(\"+\"&ROUND(Codierung!D141,1)&\" %\")<6,\"+\"&ROUND(Codierung!D141,1)&\".0 %\",\"+\"&ROUND(Codierung!D141,1)&\" %\"),IF(LEN(ROUND(Codierung!D141,1)&\" %\")<6,ROUND(Codierung!D141,1)&\".0 %\",ROUND(Codierung!D141,1)&\" %\")),\"-\")","v":"+10.4 %"},null,null,null,"D.2.1 Imp.n.H.","D.2.1 Imp.n.H.",{"$f":"J141","v":"D.2.1 Imp.n.H."},{"$f":"J141","v":"D.2.1 Imp.n.H."}]
[{"$f":"'2.1 Imp.n.H.'!B29","v":"Niederlande"},{"$f":"'2.1 Imp.n.H.'!E29","v":83.427017661999997},{"$f":"'2.1 Imp.n.H.'!F29","v":89.196105500740003},6.9151313332488362,{"$f":"IFERROR(IF(Codierung!D142>0,IF(LEN(\"+\"&ROUND(Codierung!D142,1)&\" %\")<6,\"+\"&ROUND(Codierung!D142,1)&\".0 %\",\"+\"&ROUND(Codierung!D142,1)&\" %\"),IF(LEN(ROUND(Codierung!D142,1)&\" %\")<6,ROUND(Codierung!D142,1)&\".0 %\",ROUND(Codierung!D142,1)&\" %\")),\"-\")","v":"+6.9 %"},null,null,null,"D.2.2 Imp.n.Kont.","D.2.2 Imp.n.Kont.","D.2.2 Imp.n.Kont.","D.2.2 Imp.n.Kont."]
[null,null,null,null,null,null,null,null,"D.2.3 aVV","D.2.3 aVV",{"$f":"J143","v":"D.2.3 aVV"},{"$f":"J143","v":"D.2.3 aVV"}]
[{"$f":"Codierung!$I$172&\" - \"&Codierung!$I$40","v":"Auslastung der Importkontingente - Konsumeier"},null,null,null,{"$f":"IF('2.2 Imp.n.Kont.'!I17>0,IF(LEN(\"+\"&ROUND('2.2 Imp.n.Kont.'!I17,1)&\" %\")<6,\"+\"&ROUND('2.2 Imp.n.Kont.'!I17,1)&\".0 %\",\"+\"&ROUND('2.2 Imp.n.Kont.'!I17,1)&\" %\"),IF(LEN(ROUND('2.2 Imp.n.Kont.'!I17,1)&\" %\")<6,ROUND('2.2 Imp.n.Kont.'!I17,1)&\".0 %\",ROUND('2.2 Imp.n.Kont.'!I17,1)&\" %\"))","v":"-8.6 %"},null,null,null,"D.2.4 Imp. LM","D.2.4 Imp. LM",{"$f":"J144","v":"D.2.4 Imp. LM"},{"$f":"J144","v":"D.2.4 Imp. LM"}]
[{"$f":"Codierung!$I$172&\" - \"&Codierung!$I$41","v":"Auslastung der Importkontingente - Verarbeitungseier"},null,null,null,{"$f":"IF('2.2 Imp.n.Kont.'!I21>0,IF(LEN(\"+\"&ROUND('2.2 Imp.n.Kont.'!I21,1)&\" %\")<6,\"+\"&ROUND('2.2 Imp.n.Kont.'!I21,1)&\".0 %\",\"+\"&ROUND('2.2 Imp.n.Kont.'!I21,1)&\" %\"),IF(LEN(ROUND('2.2 Imp.n.Kont.'!I21,1)&\" %\")<6,ROUND('2.2 Imp.n.Kont.'!I21,1)&\".0 %\",ROUND('2.2 Imp.n.Kont.'!I21,1)&\" %\"))","v":"-28.8 %"},null,null,null,"D.3 MEM","D.3 MEM","D.3 MEM","D.3 MEM"]
[null,null,null,null,null,null,null,null,"D.4 PP","D.4 PP","D.4 PP","D.4 PP"]
[null,null,null,null,null,null,null,null,"D.5 GHP Gastro","D.5 GHP Gastro","D.5 GHP Gastro","D.5 GHP Gastro"]
[null,null,null,null,null,null,null,null,"D.6 KP","D.6 KP","D.6 KP","D.6 KP"]
[null,null,null,null,null,null,null,null,"D.7 MS","D.7 MS","D.7 MS","D.7 MS"]
[null,null,null,null,null,null,null,null,"D.8 BWS","D.8 BWS","D.8 BWS","D.8 BWS"]
[null,null,null,null,null,null,null,null,"D.9 Int.","D.9 Int.","D.9 Int.","D.9 int."]
[null,null,null,null,null,null,null,null,"10. Methoden","10. Methoden","10. Méthode","10. Metodo"]
[null,null,null,null,null,null,null,null,"Codierung","Codierung","Codage","Codifica"]
[null,null,null,null,null,null,null,null,"Zurück zum Inhaltsverzeichnis","Zurück zum Inhaltsverzeichnis","Retour à la table des matières","Torna al contenuto"]
[null,null,null,null,null,null,null,null,"Markt aktuell","Markt aktuell","Actualités du marché","Situazione del mercato"]
[null,null,null,null,null,null,null,null,"Bestellformular für Abonnemente:","Bestellformular für Abonnemente:","Formulaire de commande d’abonnements:","Modulo per la sottoscrizione di un abbonamento:"]
[null,null,null,null,null,null,null,null,"\"Versteckte\" Eierimporte in Lebensmittelzubereitungen","\"Versteckte\" Eierimporte in Lebensmittelzubereitungen","Importations d'œufs \"cachées\" dans les préparations alimentaires","Importazioni di uova «nascoste» nelle preparazioni alimentari"]
[null,null,null,null,null,null,null,null,"Eier in importieren Lebensmittelzubereitungen","Eier in importieren Lebensmittelzubereitungen","Œufs dans des préparations alimentaires importées","Uova nelle preparazioni alimentari importate "]
[null,null,null,null,null,null,null,null,"statistisch erfasster Verbrauch","statistisch erfasster Verbrauch","Consommation recensée statistiquement","consumo registrato statisticamente"]
[null,null,null,null,null,null,null,null,"importierte Lebensmittelzubereitungen","importierte Lebensmittelzubereitungen","Préparations alimentaires importées","preparazioni alimentari importate"]
[null,null,null,null,null,null,null,null,"Geschätzte Handelsbilanz (Importüberschuss) von Eiern aus Lebensmittelzubereitungen","Geschätzte Handelsbilanz (Importüberschuss) von Eiern aus Lebensmittelzubereitungen","Estimation de la balance commerciale (excédent d'importation) des oeufs dans les préparations alimentaires","Bilancia commerciale stimata (eccedenza di importazioni) di uova derivanti da preparazioni alimentari"]
[null,null,null,null,null,null,null,null,"Zusätzlicher geschätzter Pro-Kopf-Verbrauch von Eiern aus importierten Lebensmittelzubereitungen","Zusätzlicher geschätzter Pro-Kopf-Verbrauch von Eiern aus importierten Lebensmittelzubereitungen","Estimation de la consommation supplémentaire d'oeufs par personne via les préparations alimentaires importées","Consumo di uova pro capite supplementare stimato derivante da preparazioni alimentari importate"]
[null,null,null,null,null,null,null,null,0]
[null,null,null,null,null,null,null,null,0]
[null,null,null,null,null,null,null,null,0]
[null,null,null,null,null,null,null,null,0]
[null,null,null,null,null,null,null,null,0]
[null,null,null,null,null,null,null,"Titel Arbeitsblätter","Marktbericht Eier","Marktbericht Eier","Bulletin du marché des oeufs","Rapporto sul mercato delle uova"]
[null,null,null,null,null,null,null,null,"Inhaltsverzeichnis + Front Story","Inhaltsverzeichnis + Front Story","Table des matières + Front Story","Contenuto + Front Story"]
[null,null,null,null,null,null,null,null,"Produktion, Aussenhandel und Verbrauch","Produktion, Aussenhandel und Verbrauch","Production, commerce extérieur et consommation","Produzione, commercio estero e consumo"]
[null,null,null,null,null,null,null,null,"Importe nach Herkunft","Importe nach Herkunft","Importations par origine","Importazioni per provenienza"]
[null,null,null,null,null,null,null,null,"Auslastung der Importkontingente","Auslastung der Importkontingente","Utilisation des contingents d'importation","Grado di utilizzo dei contingenti d'importazione"]
[null,null,null,null,null,null,null,null,"Marktentlastungsmassnahmen ","Marktentlastungsmassnahmen ","Mesures d’allégement du marché ","Provvedimenti di sgravio del mercato"]
[null,null,null,null,null,null,null,null,"Aktiver Veredelungsverkehr (ohne Produkte für technische Zwecke)","Aktiver Veredelungsverkehr (ohne Produkte für technische Zwecke)","Trafic de perfectionnement actif (sans les produits destinés à des fins techniques)","Traffico di perfezionamento attivo (senza prodotti per scopi tecnici)"]
[null,null,null,null,null,null,null,null,"Produzenten- und Importpreise","Produzenten- und Importpreise","Prix à la production et à l'importation","Prezzi alla produzione e all'importazione"]
[null,null,null,null,null,null,null,null,"Preise im Liefer- und Abholgrosshandel","Preise im Liefer- und Abholgrosshandel","Prix dans le libre-service de gros","Prezzi nella fornitura e nell’acquisto all’ingrosso"]
[null,null,null,null,null,null,null,null,"Marktstruktur","Marktstruktur","Structure du marché","Struttura del mercato"]
[null,null,null,null,null,null,null,null,"Bruttowertschöpfung","Bruttowertschöpfung","Valeurs ajoutées brutes","Valori aggiunti lordi"]
[null,null,null,null,null,null,null,null,"Internationale Marktzahlen","Internationale Marktzahlen","Chiffres sur les marchés internationaux","Dati sul mercato internazionale"]
[null,null,null,null,null,null,null,null,"Bruttowertschöpfung","Bruttowertschöpfung","Valeurs ajoutées brutes","Valori aggiunti lordi"]
[null,null,null,null,null,null,null,null,"Methoden","Methoden","Méthode","Considerazioni di natura metodologica"]
[null,null,null,null,null,null,null,null,"monatlich","monatlich","mensuel","mensile"]
[null,null,null,null,null,null,null,null,"Haftung","Haftung","Responsabilité","Responsabilità"]
[null,null,null,null,null,null,null,null,{"$f":"IF($I$1=\"d\",J184,IF($I$1=\"f\",K184,IF($I$1=\"i\",L184)))","v":"Eidgenössisches Departement für  Wirtschaft, Bildung und Forschung WBF"},"Eidgenössisches Departement für  Wirtschaft, Bildung und Forschung WBF","Département fédéral de l’économie,de la formation et de la recherche DEFR","Dipartimento federale dell'economia, della formazione e della ricerca DEFR"]
[null,null,null,null,null,null,null,null,"Bundesamt für Landwirtschaft BLW","Bundesamt für Landwirtschaft BLW","Office fédéral de l’agriculture OFAG","Ufficio federale dell’agricoltura UFAG"]
[null,null,null,null,null,null,null,null,"Fachbereich Marktanalysen","Fachbereich Marktanalysen","Secteur Analyses du marché","Settore Analisi del mercato"]
[null,null,null,null,null,null,null,"Länder","Schweiz","Schweiz","Suisse","Svizzera"]
[null,null,null,null,null,null,null,null,"Deutschland","Deutschland","Allemagne","Germania"]
[null,null,null,null,null,null,null,null,"Frankreich","Frankreich","France","Francia"]
[null,null,null,null,null,null,null,null,"Österreich","Österreich","Autriche","Austria"]
[null,null,null,null,null,null,null,null,"Italien","Italien","Italie","Italia"]
[null,null,null,null,null,null,null,null,"Dänemark","Dänemark","Danemark","Danimarca"]
[null,null,null,null,null,null,null,null,"UK","UK","UK","Gran Bretagna"]
[null,null,null,null,null,null,null,null,"EU","EU","UE","Unione europea"]
[null,null,null,null,null,null,null,null,"EU-15","EU-15","EU-15","UE-15"]
[null,null,null,null,null,null,null,null,"USA","USA","USA","USA"]
[null,null,null,null,null,null,null,null,"Singapur","Singapur","Singapour","Singapore"]
[null,null,null,null,null,null,null,null,"Niederlande","Niederlande","Pays-Bas","Paesi Bassi"]
[null,null,null,null,null,null,null,null,"Belgien","Belgien","Belgique","Belgio"]
[null,null,null,null,null,null,null,null,"Polen","Polen","Pologne","Polonia"]
[null,null,null,null,null,null,null,null,"Bulgarien","Bulgarien","Bulgarie","Bulgaria"]
[null,null,null,null,null,null,null,null,"Rest","Rest","Autres pays","Altri Paesi"]
[null,null,null,null,null,null,null,null,0]
[null,null,null,null,null,null,null,null,0]
[null,null,null,null,null,null,null,"Quellenangaben","Quellen: BLW, Fachbereich Marktanalysen","Quellen: BLW, Fachbereich Marktanalysen","Sources: OFAG, secteur Analyses du marché","Fonti: UFAG, Settore Analisi del mercato"]
[null,null,null,null,null,null,null,null,"Quellen: BLW, Fachbereich Marktanalysen; EZV","Quellen: BLW, Fachbereich Marktanalysen; EZV","Sources: OFAG, secteur Analyses du marché; AFD","Fonti: UFAG, Settore Analisi del mercato; AFD"]
[null,null,null,null,null,null,null,null,"Quellen: BLW, Fachbereich Marktanalysen; Grossopanel AG, Stans","Quellen: BLW, Fachbereich Marktanalysen; Grossopanel AG, Stans","Sources: OFAG, secteur Analyses de marché; Grossopanel AG, Stans","Fonti: UFAG, Settore Analisi de mercato; Grossopanel AG, Stans"]
[null,null,null,null,null,null,null,null,"Quellen: SBV","Quellen: SBV","Sources: USP","Fonti: USC"]
[null,null,null,null,null,null,null,null,"Quellen: KIC, BLW Fachbereich Marktanalysen","Quellen: KIC, BLW Fachbereich Marktanalysen","Sources: KIC, OFAG, secteur Analyses de marché","Fonti: KIC, UFAG, Settore Analisi del mercato"]
[null,null,null,null,null,null,null,null,"Quellen: BLW, Fachbereich Marktanalysen; SBV; EZV; Aviforum","Quellen: BLW, Fachbereich Marktanalysen; SBV; EZV; Aviforum","Sources: OFAG, secteur Analyses de marché; USP; AFD; Aviforum","Fonti: UFAG, Settore Analisi del mercato, USC, AFD, Aviforum"]
[null,null,null,null,null,null,null,null,"Quellen: BLW, Fachbereich Marktanalysen; Aviforum; NielsenIQ Switzerland, Total Market Consumer/Retail Panel; Grossopanel AG, Stans","Quellen: BLW, Fachbereich Marktanalysen; Aviforum; NielsenIQ Switzerland, Total Market Consumer/Retail Panel; Grossopanel AG, Stans","Sources: OFAG, secteur Analyses de marché; Aviforum; NielsenIQ Switzerland, Total Market Consumer/Retail Panel; Grossopanel AG, Stans","Fonti: UFAG, Settore Analisi del mercato, Aviforum; NielsenIQ Switzerland, Total Market Consumer/Retail Panel; Grossopanel AG, Stans"]
[null,null,null,null,null,null,null,null,"Quellen Preise: AMA Österreich; GfK Austria MEG Deutschland; AMI Deutschland","Quellen Preise: AMA Österreich; GfK Austria MEG Deutschland; AMI Deutschland","Sources prix:  AMA Autriche; GfK Autriche MEG Allemagne; AMI Allemagne","Fonti prezzi: AMA Austria; GfK Austria MEG Germania; AMI Germania"]
[null,null,null,null,null,null,null,null,"Quellen: GfK Austria MEG Deutschland","Quellen: GfK Austria MEG Deutschland","Sources: GfK Austriche; MEG Allemagne","Fonti: GfK Austria; MEG Germania"]
[null,null,null,null,null,null,null,null,"Quellen Pro-Kopf-Verbrauch: BLE; Statistik Austria; EU; USDA; Agri-Food & Veterinary Authority of Singapore","Quellen Pro-Kopf-Verbrauch: BLE; Statistik Austria; EU; USDA; Agri-Food & Veterinary Authority of Singapore","Sources par consommation, par habitant: BLE; Statistiques  Austria; EU; USDA; Agri-Food & Veterinary Authority of Singapore","Fonti consumo pro capite: BLE; Statistik Austria; EU; USDA; Agri-Food & Veterinary Authority of Singapore"]
[null,null,null,null,null,null,null,null,"Publikationsrecht: Weiterverarbeitung und Publikation unter Quellenangabe gestattet.","Publikationsrecht: Weiterverarbeitung und Publikation unter Quellenangabe gestattet.","Droit de publication: traitement et publication autorisés sous réserve de la mention de la source.","Diritto di pubblicazione: rielaborazione e pubblicazione consentite citando la fonte"]
[null,null,null,null,null,null,null,null,"Die Monatspreise liegen dem Fachbereich Marktanalysen vor, aufgrund von Publikationsrechten wird jedoch nur der Durchschnitt der letzten 3 Monate veröffentlicht.","Die Monatspreise liegen dem Fachbereich Marktanalysen vor, aufgrund von Publikationsrechten wird jedoch nur der Durchschnitt der letzten 3 Monate veröffentlicht.","Le secteur Analyses du marché dispose des prix mensuels mais publie la moyenne des 3 derniers mois en raison des restrictions de droits de publication.","Il Settore Analisi del mercato dispone dei prezzi mensili ma pubblica la media degli ultimi 3 mesi date le limitazioni dei diritti di pubblicazione."]
[null,null,null,null,null,null,null,"Einheiten",{"$f":"IF($I$1=\"d\",J217,IF($I$1=\"f\",K217,IF($I$1=\"i\",L217)))","v":"in CHF / Ei"},"in CHF / Ei","en CHF/œuf","in CHF/uovo"]
[null,null,null,null,null,null,null,null,"in Euro / Ei","in Euro / Ei","en EUR/œuf","in EUR/uovo"]
[null,null,null,null,null,null,null,null,"in Tonnen","in Tonnen","en tonnes","in t"]
[null,null,null,null,null,null,null,null,"in Stück","in Stück","en pièces","in pezzi"]
[null,null,null,null,null,null,null,null,"in CHF","in CHF","en CHF","in CHF "]
[null,null,null,null,null,null,null,null,"in Mio. Stück","in Mio. Stück","en millions de pièces","in mio. pezzi"]
[null,null,null,null,null,null,null,null,"in Stück / Kopf","in Stück / Kopf","en pièces / personne","in pezzi pro capite"]
[null,null,null,null,null,null,null,null,"in %","in %","en %","in %"]
[null,null,null,null,null,null,null,null,"in Anz. Personen","in Anz. Personen","en nombre de personnes","in n. persone"]
[null,null,null,null,null,null,null,null,"in 1 000 CHF","in 1 000 CHF","en 1 000 CHF","in 1 000 CHF "]
[]
[null,null,null,null,null,null,null,"Tabellenbeschriftung","Vorjahr","Vorjahr","année précédente","anno precedente"]
[null,null,null,null,null,null,null,null,"Vormonat","Vormonat","mois précédent","mese precedente"]
[null,null,null,null,null,null,null,null,"von","von","de","da"]
[null,null,null,null,null,null,null,null,"bis","bis","à","a"]
[null,null,null,null,null,null,null,null,"Periode","Periode","Période","Periodo"]
[null,null,null,null,null,null,null,null,"%-∆ Vorjahr","%-∆ Vorjahr","%-∆ année précédente","%-∆ anno precedente"]
[null,null,null,null,null,null,null,null,"%-∆ VM","%-∆ VM","%-∆ MP","%-∆ MP"]
[null,null,null,null,null,null,null,null,"%-∆ VP","%-∆ VP","%-∆ PP","%-∆ PP"]
[null,null,null,null,null,null,null,null,"Vorvorjahr","Vorvorjahr","l’année antérieure de deux ans à l’année de contribution ","due anni fa"]
[null,null,null,null,null,null,null,null,"%-∆","%-∆","%-∆","%-∆"]
[null,null,null,null,null,null,null,null,{"$f":"IF($I$1=\"d\",J238,IF($I$1=\"f\",K238,IF($I$1=\"i\",L238)))","v":"Daten Import"},"Daten Import","Données import","Dati importazione"]
[]
[null,null,null,null,null,null,null,"Haftung","Quelle Themenbilder:","Quelle Themenbilder:","Source des illustrations:","Fonte immagini pagg.:"]
[null,null,null,null,null,null,null,null,"Zu Haftung, Datenschutz, Copyright und Weiterem siehe:","Zu Haftung, Datenschutz, Copyright und Weiterem siehe:","Pour toute question relative à la responsabilité, à la protection des données, au copyright et autres, cf. :","Per informazioni su responsabilità, protezione dei dati, eccetera vedasi:"]
[null,null,null,null,null,null,null,"Anmerkungen","Anmerkungen:","Anmerkungen:","Remarques:","Note:"]
[null,null,null,null,null,null,null,null,"Schätzung PaKo (paritätische Kommission Eier)","Schätzung PaKo (paritätische Kommission Eier)","Estimation PaKo (Commission Paritaire Œuf)","Stima Commissione paritetica uova (CP uova)"]
[null,null,null,null,null,null,null,null,"Schätzung Agristat (SBV)","Schätzung Agristat (SBV)","Estimation Agristat (USP)","Stima Agristat (USC)"]
[null,null,null,null,null,null,null,null,"Bis 2015: Berechnung/Schätzung Aviforum; ab 2016: Erhebung BLW","Bis 2015: Berechnung/Schätzung Aviforum; ab 2016: Erhebung BLW","Jusqu'en 2015 : Calcul/estimation Aviforum; à partir de 2016 : Relevé de l'OFAG","Fino al 2015: Calcolo/stima Aviforum; dal 2016: Rilevazione dell'UFAG"]
[null,null,null,null,null,null,null,null,"Verbrauch und Importe nun bereinigt (ohne Veredelungsverkehr)","Verbrauch und Importe nun bereinigt (ohne Veredelungsverkehr)","Consommation et importations mis à jour (sans le trafic de perfectionnement)","Consumo e importazioni rettificati (senza traffico di perfezionamento)"]
[null,null,null,null,null,null,null,null,"Deckelung der ausbezahlten Mittel (rot markiert); Kürzung der Beiträge je Ei","Deckelung der ausbezahlten Mittel (rot markiert); Kürzung der Beiträge je Ei","Plafonnement des moyens versés (marqué en rouge); Réduction des contributions par œuf","Livellamento dei mezzi finanziari versati (in rosso); Riduzione dei contributi per uovo"]
[null,null,null,null,null,null,null,null,"Erweiterung der Datenerhebungen bei den Sammelstellen","Erweiterung der Datenerhebungen bei den Sammelstellen","Extension des relevés de données dans les centres collecteurs","Ampliamento delle rilevazioni presso i centri di raccolta"]
[null,null,null,null,null,null,null,null,"Aufgrund der zu kleinen Stichprobe können diese Preise aus datenschutzrechtlichen Gründen nicht mehr publiziert werden","Aufgrund der zu kleinen Stichprobe können diese Preise aus datenschutzrechtlichen Gründen nicht mehr publiziert werden","L’échantillon étant trop restreint, ces prix ne peuvent plus être publiés pour des raisons liées à la protection des données","Date le dimensioni troppo piccole del campione questi prezzi non possono più essere pubblicati per motivi legati al diritto sulla protezione dei dati"]
[null,null,null,null,null,null,null,null,"Produzentenpreise für Eier, welche an Feinkostläden und den Fachhandel geliefert werden (darum nicht repräsentativ für Gesamtmarkt, wo durchschnittlich tiefere Preise ausbezahlt werden)","Produzentenpreise für Eier, welche an Feinkostläden und den Fachhandel geliefert werden (darum nicht repräsentativ für Gesamtmarkt, wo durchschnittlich tiefere Preise ausbezahlt werden)","Prix à la production des œufs livrés dans les épiceries fines et le commerce spécialisé (qui ne sont donc pas représentatifs de l’ensemble du marché, où les prix moyens payés sont plus bas)","Prezzi alla produzione delle uova fornite a negozi specializzati e di gastronomia (non rappresentativi per il mercato globale, dove in media sono pagati prezzi più bassi)"]
[null,null,null,null,null,null,null,null,"Umrechnungsfaktoren: Eiprodukte getrocknet 80 Eier / kg; Eiprodukte flüssig 20.58 Eier / kg; Schaleneier 16.6 Eier / kg","Umrechnungsfaktoren: Eiprodukte getrocknet 80 Eier / kg; Eiprodukte flüssig 20.58 Eier / kg; Schaleneier 16.6 Eier / kg","Coefficients de conversion: ovoproduits séchés 80 œufs / kg; ovoproduits liquides 20.58 oeufs / kg; œufs en coquille 16.6 œufs / kg","Coefficenti di conversione: prodotti di uova essiccati 80 uova/kg; prodotti di uova liquidi 20.58 uova/kg; uova in guscio 16.6 uova/kg"]
[null,null,null,null,null,null,null,null,"Ø ","Ø ","Ø ","Ø "]
[null,null,null,null,null,null,null,null,{"$f":"IF($I$1=\"d\",J253,IF($I$1=\"f\",K253,IF($I$1=\"i\",L253)))","v":"Informationen zur Methodik"},"Informationen zur Methodik","Informations relatives à la méthode","Informazioni sul metodo"]
[null,null,null,null,null,null,null,null,{"$f":"IF($I$1=\"d\",J254,IF($I$1=\"f\",K254,IF($I$1=\"i\",L254)))","v":"Nur Kleinmengen (Absatz von 1 bis 15 Kartons)"},"Nur Kleinmengen (Absatz von 1 bis 15 Kartons)","Seulenment des petites quantités (1 à 15 cartons)","Solo piccoli quantitativi (smercio di 1 fino a 15 cartoni)"]
[null,null,null,null,null,null,null,null,"Verarbeitungseier (oft aus Bodenhaltung) direkt für die Industrie werden in der Erhebung Sammelstellen tendenziell unterproportional einbezogen","Verarbeitungseier (oft aus Bodenhaltung) direkt für die Industrie werden in der Erhebung Sammelstellen tendenziell unterproportional einbezogen","Les oeufs de fabrication (souvent issus de l'élevage au sol) destinés directement à l'industrie sont tendanciellement sous-représentés dans le relevé des centres de collecte","Le uova di trasformazione (spesso da allevamento al suolo) direttamente per l'industria sono incluse tendenzialmente in modo sottoproporzionale nel rilevamento nei centri di raccolta "]
[null,null,null,null,null,null,null,null,"Aufbereitete Grafiken unterhalb der Datentabellen","Aufbereitete Grafiken unterhalb der Datentabellen","Graphiques figurant sous les tableaux de données","Grafici al di sotto delle tabelle"]
[null,null,null,null,null,null,null,null,"Ab 2016 wurde die Konsumentenpreiserhebung erweitert. Der Discountmarkt ist nun mit drei Akteuren in der Erhebung vertreten. Dadurch sind die Preise leicht gesunken.","Ab 2016 wurde die Konsumentenpreiserhebung erweitert. Der Discountmarkt ist nun mit drei Akteuren in der Erhebung vertreten. Dadurch sind die Preise leicht gesunken.","Le relevé des prix à la consommation a été étendu à partir de 2016. \nLes discounters sont désormais représentés par trois acteurs. \nLes prix ont de ce fait légèrement baissé.","Dal 2016 la rilevazione dei prezzi al consumo è stata estesa, includendo anche il mercato dei discount, rappresentato da tre attori. Ciò ha determinato una lieve diminuzione dei prezzi."]
[null,null,null,null,null,null,null,null,"Importe ohne Veredelungsverkehr, inklusive Rückwaren","Importe ohne Veredelungsverkehr, inklusive Rückwaren","Importations sans le trafic de perfectionnement, marchandises en retour incluses","Importazioni traffico di perfezionamento escluso, merci in reintroduzione incluse."]
[null,null,null,null,null,null,null,null,"Die Zollkontingente beziehen sich auf Brutto-Mengen","Die Zollkontingente beziehen sich auf Brutto-Mengen","Les contingents tarifaires se rapportent à des quantités brutes.","I contingenti doganali si riferiscono ai quantitativi lordi."]
[null,null,null,null,null,null,null,null,"2017: Erweiterung Erhebung Kükenstatistik aufgrund angepasster Marktverhältnisse (Erhöhung Inlandproduktion um ca. 17 Mio. Eier bzw. ca. + 2 Eier / Kopf)","2017: Erweiterung Erhebung Kükenstatistik aufgrund angepasster Marktverhältnisse (Erhöhung Inlandproduktion um ca. 17 Mio. Eier bzw. ca. + 2 Eier / Kopf)","2017: Extension des relevés statistiques sur les poussins en raison du changement des conditions du marché (augmentation de la production indigène d’environ 17 millions d’œufs  consommation d’environ + 2 œufs / personne)","2017: Estensione del rilevamento concernente la statistica dei pulcini in seguito a mutate condizioni di mercato (aumento della produzione indigena di ca. 17 mio. di uova à aumento del consumo di ca. 2 uova pro capite)"]
[null,null,null,null,null,null,null,null,"Inoffizielle Schätzung","Inoffizielle Schätzung","Estimation non officielle","Stima non ufficiale"]
[null,null,null,null,null,null,null,null,"Ab 2019 wurde die Konsumentenpreiserhebung erweitert. Der Verbrauchermarkt ist nun mit zwei Akteuren in der Erhebung vertreten. Die Preise blieben konstant.","Ab 2019 wurde die Konsumentenpreiserhebung erweitert. Der Verbrauchermarkt ist nun mit zwei Akteuren in der Erhebung vertreten. Die Preise blieben konstant.","Le relevé des prix à la consommation a été étendu à partir de 2019. Le marché de la consommation est désormais représenté par deux acteurs dans l'enquête. Les prix sont restés constants.","Dal 2019, la rilevazione dei prezzi al consumo è stata estesa. Il ipermercato è rappresentato da due attori. I prezzi sono rimasti costanti."]
[null,null,null,null,null,null,null,null,"Erweiterung des Datenpanels von Grossopanel","Erweiterung des Datenpanels von Grossopanel","Extension du panel de données de Grossopanel","Estensione del pannello dati di Grossopanel"]
[null,null,null,null,null,null,null,null,"Das BLW hat auf Anträgen der Branche das Kontingent für Konsumeierimporte um insgesamt 3'000 Tonnen erhöht infolge der hohen Nachfrage nach Schaleneiern wegen des vermehrten pandemiebedingten Konsums zu Hause","Das BLW hat auf Anträgen der Branche das Kontingent für Konsumeierimporte um insgesamt 3'000 Tonnen erhöht infolge der hohen Nachfrage nach Schaleneiern wegen des vermehrten pandemiebedingten Konsums zu Hause","A la demande de la branche, l'OFAG a augmenté le contingent d'importation d'œufs de consommation de 3000 tonnes au total, en raison de la forte demande d'œufs en coquille due à l'augmentation de la consommation domestique consécutive à la pandémie.","Su richiesta dell'industria, l'UFAG ha aumentato il contingente d'importazione delle uova da tavola di un totale di 3000 tonnellate a causa della forte domanda di uova in guscio dovuta all'aumento del consumo in patria in seguito alla pandemia."]
[null,null,null,null,null,null,null,null,"Erhebung Schweizer Vearbeitungseiermengen seit 2020 (rückwirkend bis 2016) direkt bei den Betrieben und Verarbeitungsunternehmen","Erhebung Schweizer Vearbeitungseiermengen seit 2020 (rückwirkend bis 2016) direkt bei den Betrieben und Verarbeitungsunternehmen","Relevé des quantités d'œufs transformés suisses depuis 2020 (rétroactif à 2016) directement dans les exploitations et les entreprises de transformation.","Rilevazione delle quantità di uova lavorate in Svizzera dal 2020 (retroattiva al 2016) direttamente nelle aziende agricole e nelle imprese di trasformazione"]
[null,null,null,null,null,null,null,null,0]
[null,null,null,null,null,null,null,"Methodik neu","Produktion, Aussenhandel und Verbrauch","Produktion, Aussenhandel und Verbrauch","Production, commerce extérieur et consommation","Produzione, commercio estero e consumo"]
[null,null,null,null,null,null,null,null,"■   Die Bevölkerungsschätzung stammt vom SBV und dient zur Berechnung des Pro-Kopf-Verbrauchs in der Schweiz. In der Schätzung enthalten sind ebenfalls Touristen und Grenzgänger.","■   Die Bevölkerungsschätzung stammt vom SBV und dient zur Berechnung des Pro-Kopf-Verbrauchs in der Schweiz. In der Schätzung enthalten sind ebenfalls Touristen und Grenzgänger.","■   L'estimation de la population provient de l'USP et sert à calculer la consommation par habitant en Suisse. L’estimation prend également en compte les touristes et les frontaliers.","■   La stima della popolazione proviene dall'USC e serve per calcolare il consumo pro capite in Svizzera. Nella stima sono inclusi anche turisti e frontalieri."]
[null,null,null,null,null,null,null,null,"■   Die Inlandproduktion wird anhand der „Kükenstatistik“ geschätzt und stammt vom Aviforum.","■   Die Inlandproduktion wird anhand der „Kükenstatistik“ geschätzt und stammt vom Aviforum.","■   La production indigène est estimée à l'aide de la „Kükenstatistik“ qui provient de Aviforum.","■   La produzione indigena è stimata sulla base della \"Statistica dei pulcini\" e proviene da Aviforum. "]
[null,null,null,null,null,null,null,null,"■   Die Aussenhandelszahlen stammen vom BAZG.","■   Die Aussenhandelszahlen stammen vom BAZG.","■   Les chiffres relatifs au commerce extérieur proviennent de l'AFD.","■   Le cifre del commercio estero provengono dall'AFD."]
[null,null,null,null,null,null,null,null,"   o   Importe werden jeweils abzüglich der Exporte (in vernachlässigbarer Grössenordnung) sowie ohne Rückwaren und Importe von Produkten zu technischen Zwecken (etwa der Forschung) dargestellt.","   o   Importe werden jeweils abzüglich der Exporte (in vernachlässigbarer Grössenordnung) sowie ohne Rückwaren und Importe von Produkten zu technischen Zwecken (etwa der Forschung) dargestellt.","   o   Les importations sont toujours prises en compte déduction faite des exportations (en ordre de grandeur négligeable), des restitutions de marchandises et des importations de produits effectuées à des fins techniques (par ex. à des fins de recherche).","   o   Le importazioni sono rappresentate al netto delle esportazioni (di entità trascurabile) escl. resi e importazioni di prodotti per scopi tecnici (p.es. ricerca). "]
[null,null,null,null,null,null,null,null,"   o   Der Veredelungsverkehr fliesst nicht in die Aussenhandelsstatistik ein (siehe dazu unten Abschnitt \"Aktiver Veredelungsverkehr (aVV)\").","   o   Der Veredelungsverkehr fliesst nicht in die Aussenhandelsstatistik ein (siehe dazu unten Abschnitt \"Aktiver Veredelungsverkehr (aVV)\").","   o   Le trafic de perfectionnement est compris dans la statistique du commerce extérieur (cf. à ce sujet le chapitre \"Trafic de perfectionnement actif (TPA)\").","   o   Il traffico di perfezionamento non rientra nella statistica sul commercio estero (cfr. sezione Traffico di perfezionamento attivo)"]
[null,null,null,null,null,null,null,null,"■   Die Menge der Schweizer Verarbeitungseier basiert auf einer Datenerhebung des Fachbereichs Marktanalysen bei Unternehmen und Geflügelbetrieben mit eigener Eierverarbeitung.","■   Die Menge der Schweizer Verarbeitungseier basiert auf einer Datenerhebung des Fachbereichs Marktanalysen bei Unternehmen und Geflügelbetrieben mit eigener Eierverarbeitung.","■   Les chiffres des volumes d’œufs suisses destinés à la transformation se basent sur une collecte de données du secteur Analyses du marché réalisée auprès d’entreprises et d’exploitations avicoles disposant de leurs propres ateliers de transformation d’œufs.","■   Il quantitativo di uova di trasformazione svizzere è ricavato da una rilevazione effettuata dal Settore Analisi del mercato presso le im-prese e le aziende avicole dedite alla trasformazione di uova."]
[null,null,null,null,null,null,null,null,"■   Der Eier-Verbrauch entspricht der Summe der im Inland produzierten Eier und der importierten Eier und Eiprodukte abzüglich der Exporte von Ei- und Eiprodukten. Nicht berücksichtigt im Verbrauch werden Eier, welche in verarbeiteter Form, welche über den Verarbeitungsgrad von Eiprodukten hinausgeht, importiert werden (z.B. als Back- und Teigwaren, Süssigkeiten etc.) sowie die Ei-Verluste, welche im Lauf durch die Wertschöpfungskette entstehen (Food Waste). Der Einkaufstourismus ist ebenfalls nicht in der Rechnung enthalten.","■   Der Eier-Verbrauch entspricht der Summe der im Inland produzierten Eier und der importierten Eier und Eiprodukte abzüglich der Exporte von Ei- und Eiprodukten. Nicht berücksichtigt im Verbrauch werden Eier, welche in verarbeiteter Form, welche über den Verarbeitungsgrad von Eiprodukten hinausgeht, importiert werden (z.B. als Back- und Teigwaren, Süssigkeiten etc.) sowie die Ei-Verluste, welche im Lauf durch die Wertschöpfungskette entstehen (Food Waste). Der Einkaufstourismus ist ebenfalls nicht in der Rechnung enthalten.","■   La consommation d'oeufs correspond à la somme des œufs produits dans le pays et des oeufs ainsi que des ovoproduits à importés, moins les exportations dœufs et d'ovoproduits. Les statistiques de la consommation ne tiennent pas compte des œufs qui sont importés sous forme d’œufs transformés et dont le degré de transformation va au-delà des ovoproduits (par ex. les produits de boulangerie, les pâtes alimentaires, les sucreries, etc.) ainsi que les pertes qui ont lieu le long de la chaine de création de valeur (gaspillage). Le tourisme d’achat n’est pas pris en compte non plus.","■    Il consumo di uova corrisponde alla somma delle uova prodotte all'interno del Paese e delle uova e prodotti di uova importati al netto delle esportazioni di uova e prodotti di uova. Non sono considerate nel consumo le uova importate il cui grado di trasformazionesupera quello dei prodotti di uova (p.es. paste e prodotti da forno, dolci, ecc.) nonché le perdite di uova lungo la filiera del valore aggiunto (food waste). Non rientra nel calcolo neanche il turismo degli acquisti"]
[null,null,null,null,null,null,null,null,"■   Der Pro-Kopf-Verbrauch entspricht den konsumierten Eiern (unter „Verbrauch Inland“) pro Kopf (unter „Bevölkerung“).","■   Der Pro-Kopf-Verbrauch entspricht den konsumierten Eiern (unter „Verbrauch Inland“) pro Kopf (unter „Bevölkerung“).","■   La consommation par habitant correspond aux œufs consommés (sous „Consommation dans le pays“) par habitant (sous „Population“).","■    Il consumo pro capite corrisponde alle uova consumate (sotto \"consumo indigeno\") pro capite (sotto \"popolazione\")"]
[null,null,null,null,null,null,null,null,{"$f":"IF($I$1=\"d\",J276,IF($I$1=\"f\",K276,IF($I$1=\"i\",L276)))","v":"Aktiver Veredelungsverkehr (aVV)"},"Aktiver Veredelungsverkehr (aVV)","Trafic de perfectionnement actif (TPa)","Traffico di perfezionamento attivo"]
[null,null,null,null,null,null,null,null,"■   Der aktive Veredelungsverkehr ist umfasst die vorübergehende Einfuhr von Waren zur Bearbeitung, Verarbeitung und Ausbesserung. ","■   Der aktive Veredelungsverkehr ist umfasst die vorübergehende Einfuhr von Waren zur Bearbeitung, Verarbeitung und Ausbesserung. ","Par trafic de perfectionnement actif on entend l'importation temporaire de produits à des fins de traitement, de transformation ou d’amélioration. ","■   Il traffico di perfezionamento attivo comprende le importazioni temporanee di merci per la lavorazione, trasformazione o raffinazione."]
[null,null,null,null,null,null,null,null,"■   Erfasst werden die Importe und Re-Exporte in den Zolltarifnummern 0407, 0408 und 3502. Die Re-Exporte von im aktiven Veredelungsverkehr importierten Eiern, welche unter anderen als die genannten Zolltarifnummern wieder re-exportiert werden, werden nicht erfasst.","■   Erfasst werden die Importe und Re-Exporte in den Zolltarifnummern 0407, 0408 und 3502. Die Re-Exporte von im aktiven Veredelungsverkehr importierten Eiern, welche unter anderen als die genannten Zolltarifnummern wieder re-exportiert werden, werden nicht erfasst.","■   Sont recencées les importations et les réexportations figurant aux numéros tarifaires 0407, 0408 und 3502. Les réexportations d’œufs importés dans le cadre du trafic de perfectionnement actif, qui sont en partie réexportés sous les numéros tarifaires précités, ne sont pas recensées.","■   Sono registrate le importazioni e le riesportazioni nelle voci di tariffa 0407, 0408 e 3502. Non sono registrate le riesportazioni di uova importate nel quadro del traffico di perfezionamento attivo che sono riesportate con una voce di tariffa diversa da quelle citate."]
[null,null,null,null,null,null,null,null,"■   Die Eier-Statistik zum passiven Veredelungsverkehr wird aus Datenschutzgründen und aufgrund der geringen Relevanz nicht veröffentlicht.","■   Die Eier-Statistik zum passiven Veredelungsverkehr wird aus Datenschutzgründen und aufgrund der geringen Relevanz nicht veröffentlicht.","■   La staistique des œufs sur le trafic de perfectionnement passif n'est pas publiée pour des raisons de protection des données et en raison de son importance minime.","■   Per motivi dettati dalla protezione dei dati e dalla scarsa rilevanza, la statistica sulle uova concernente il traffico di perfezionamento passivo non è pubblicata."]
[null,null,null,null,null,null,null,null,"Marktentlastungsmassnahmen des Bundes (MEM)","Marktentlastungsmassnahmen des Bundes (MEM)","Mesures d’allègement du marché de la Confédération (MAC)","Provvedimenti statali intesi a sgravare il mercato"]
[null,null,null,null,null,null,null,null,"■   Die Marktentlastungsmassnahmen des Bundes dienen zur Angebotsstabilisierung während der Eier-Nebensaison (etwa nach Ostern). Die Erhebung der von den Massnahmen betroffenen Eier erfolgt durch das BLW.","■   Die Marktentlastungsmassnahmen des Bundes dienen zur Angebotsstabilisierung während der Eier-Nebensaison (etwa nach Ostern). Die Erhebung der von den Massnahmen betroffenen Eier erfolgt durch das BLW.","■   Les mesures d'allégement du marché de la Confédération servent à stabiliser l'offre durant la basse saison (généralement après Pâques). Le relevé des œufs concernés par les mesures est effectué par l’OFAG.","■   I provvedimenti statali intesi a sgravare il mercato mirano alla stabilizzazione dell'offerta nella bassa stagione (p.es. dopo Pasqua). La rilezione delle uova interessate dai provvedimenti avviene a cura dell'UFAG."]
[null,null,null,null,null,null,null,null,"Produzentenpreise","Produzentenpreise","Prix à la production","Prezzi alla produzione"]
[null,null,null,null,null,null,null,null,"■   Der Produzentenpreis ist der Nettopreis pro Ei ab Hof, mit Hofdatierung und Mengenzuschläge. Direktzahlungen für tierfreundliche Haltungsformen und Futter- sowie Junghennenverträge sind nicht inbegriffen. Es handelt sich um einen gemischten Preis über alle Gewichtsklassen inklusive den Eiern der zweiten Klasse (Bruch, Blut, Schmutz, Kaliber). Die Produzentenpreise werden nach den drei Haltungs- bzw. Produktionsformen Bio, Bodenhaltung und Freilandhaltung differenziert. Die Erhebung erfolgt monatlich bei fünf wichtigen schweizerischen Pack- und Sammelstellen. Die Produzentenpreise sind nach Stückzahl der umgesetzten Eier gewichtet.","■   Der Produzentenpreis ist der Nettopreis pro Ei ab Hof, mit Hofdatierung und Mengenzuschläge. Direktzahlungen für tierfreundliche Haltungsformen und Futter- sowie Junghennenverträge sind nicht inbegriffen. Es handelt sich um einen gemischten Preis über alle Gewichtsklassen inklusive den Eiern der zweiten Klasse (Bruch, Blut, Schmutz, Kaliber). Die Produzentenpreise werden nach den drei Haltungs- bzw. Produktionsformen Bio, Bodenhaltung und Freilandhaltung differenziert. Die Erhebung erfolgt monatlich bei fünf wichtigen schweizerischen Pack- und Sammelstellen. Die Produzentenpreise sind nach Stückzahl der umgesetzten Eier gewichtet.","■   Le prix à la production est formé du prix net par œuf au départ de l’exploitation y compris la taxe sur la valeur ajoutée (TVA), le datage à l’exploitation et les suppléments de quantité. Les paiements directs pour les systèmes de garde respectueux des animaux ainsi que les contrats d’affouragement et les contrats de jeunes poules ne sont pas pris en compte. Il s’agit d’un prix mixte de toutes les classes de poids y compris les œufs de deuxième catégorie (brisés, sang, salissures, calibre). Les prix à la production sont différenciés selon les trois modes d’élevage des poules, à savoir bio, élevage au sol ou élevage en plein air. Les relevés mensuels sont effectués dans six grands centres d’emballage et de collecte. Les prix à la production sont pondérés selon le nombre d’œufs commercialisés.","■    Il prezzo alla produzione è il prezzo netto per uovo franco azienda, incl. datazione e supplementi per quantità. Sono esclusi i pagamenti diretti per le forme di detenzione degli animali particolarmente rispettose degli animali e i contratti concernenti il foraggiamento e le giovani galline. Si tratta di un prezzo misto su tutte le categorie di peso, incluse le uova di seconda classe (rottura, sangue, sporcizia, calibro). I prezzi alla produzione si differenziano in base a tre metodi di allevamento e di produzione: biologico, allevamento al suolo e allevamento all’aperto. La rilevazione si effettua su base mensile presso cinque importanti centri di condizionamento e raccolta. I prezzi alla produzione sono ponderati secondo il numero di uova smerciate."]
[null,null,null,null,null,null,null,null,"Preise im Liefer- und Abholgrosshandel","Preise im Liefer- und Abholgrosshandel","prix relevés dans le libre-service de gros","Prezzi degli acquirenti e fornitori all’ingrosso "]
[null,null,null,null,null,null,null,null,"■   Preise im Liefer- und Abholgrosshandel sind nach Absatz gewichtete Abverkaufspreise. Rund 80 % des nationalen Liefer- und Abholgrosshandels in der Schweiz werden damit erfasst (Prodega/Growa, Transgourmet, Pistor, Scana und CCA Angehrn bilden die Grundgesamtheit der Auswertung). Die Roh-Daten werden von der Grossopanel AG gesammelt und dem BLW in definierter Form zur Verfügung gestellt.","■   Preise im Liefer- und Abholgrosshandel sind nach Absatz gewichtete Abverkaufspreise. Rund 80 % des nationalen Liefer- und Abholgrosshandels in der Schweiz werden damit erfasst (Prodega/Growa, Transgourmet, Pistor, Scana und CCA Angehrn bilden die Grundgesamtheit der Auswertung). Die Roh-Daten werden von der Grossopanel AG gesammelt und dem BLW in definierter Form zur Verfügung gestellt.","■   Les prix dans le libre-service de gros sont pondérés selon les ventes. Les relevés portent sur environ 80 % des libres-services de gros en Suisse (Prodega/Growa, Transgourmet, Pistor, Scana et CCA Angehrn). Les données brutes sont collectées par Grossopanel SA et mises à la disposition de l’OFAG sous une forme définie.","■   I prezzi degli acquirenti e fornitori all'ingrosso sono prezzi di vendita ponderati in base alla vendita. Circa l'80 per cento dei fornitori e acquirenti svizzeri all'ingrosso sono rilevati in tal modo (Prodega/Growa, Transgourmet, Pistor, Scana e CCA Angehrn costituiscono la base della valutazione). I dati grezzi sono raccolti da Grossopanel AG e messi a disposizione dell'UFAG in forma definita."]
[null,null,null,null,null,null,null,null,"Konsumentenpreise","Konsumentenpreise","Prix à la consommation","Prezzi al consumo"]
[null,null,null,null,null,null,null,null,"Erhebungsdaten","Erhebungsdaten","Données relevées","Base di dati"]
[null,null,null,null,null,null,null,null,"■   Die Daten stammen aus monatlichen, regionalen Erhebungen bei zwei schweizerischen Grossverteilern, zwei Verbrauchermärkten, einem Warenhaus und drei Discountern. Die Erhebungen decken knapp 90 % des inländischen Eiermarktes ab. Die restlichen Eier werden über Direktvermarktung der Produzenten und anderer Verkaufsstellen abgesetzt.","■   Die Daten stammen aus monatlichen, regionalen Erhebungen bei zwei schweizerischen Grossverteilern, zwei Verbrauchermärkten, einem Warenhaus und drei Discountern. Die Erhebungen decken knapp 90 % des inländischen Eiermarktes ab. Die restlichen Eier werden über Direktvermarktung der Produzenten und anderer Verkaufsstellen abgesetzt.","■   Les données proviennent des relevés régionaux réalisés tous les mois auprès de deux grands distributeurs suisses, de deux marchés de consommation et trois discounters. Les relevés couvrent presque 90 % du marché indigène des œufs. Le reste est écoulé par le biais de la vente directe à la ferme et d’autres points de vente.","■   I dati provengono da rilevazioni effettuate mensilmente a livello regionale presso due grandi distributori, due ipermercati e tre discount svizzeri. I dati rilevati riguardano poco meno di 90 % del mercato di uova indigene. La parte rimanente è smerciata direttamente dai contadini o attraverso altri canali di vendita."]
[null,null,null,null,null,null,null,null,"Folgende Kriterien werden bei der Erhebung berücksichtigt:","Folgende Kriterien werden bei der Erhebung berücksichtigt:","Les critères suivants sont pris en considération:","Alla base della rilevazione vi sono i seguenti criteri:"]
[null,null,null,null,null,null,null,null,"■   Anzahl Schachteln linear","■   Anzahl Schachteln linear","Nombre linéaires de boîtes","■   Numero di cartoni (sulla fila)"]
[null,null,null,null,null,null,null,null,"Die Anzahl der Schachteln in der vordersten Regalreihe dienen als Gewichtungsfaktor für die Verkaufsmenge.","Die Anzahl der Schachteln in der vordersten Regalreihe dienen als Gewichtungsfaktor für die Verkaufsmenge.","Le nombre de boîtes qui forment la première rangée de l’étal constitue le facteur de pondération pour la quantité vendue.","Il numero di cartoni sulla prima fila dello scaffale funge da fattore di ponderazione per il quantitativo di vendita."]
[null,null,null,null,null,null,null,null,"■   Art der Tierhaltung","■   Art der Tierhaltung","■   Type d'élevage","■   Metodo di allevamento"]
[null,null,null,null,null,null,null,null,"Die Erhebungen basieren auf den Produktionsformen Bodenhaltung, Freilandhaltung, Bio, 5-Getreide (pflanzliches Futter), Vital Omega 3 und AGRI-NATURA. Bei der Berechnung werden Auslaufhaltung, Freilandhaltung, und AGRI-NATURA zu Freiland- und Auslaufhaltung zusammengefasst. Die Gruppen 5-Getreide und Vital Omega 3 bilden die Gruppe Spezial (Omega 3, 5-Getreide etc.).","Die Erhebungen basieren auf den Produktionsformen Bodenhaltung, Freilandhaltung, Bio, 5-Getreide (pflanzliches Futter), Vital Omega 3 und AGRI-NATURA. Bei der Berechnung werden Auslaufhaltung, Freilandhaltung, und AGRI-NATURA zu Freiland- und Auslaufhaltung zusammengefasst. Die Gruppen 5-Getreide und Vital Omega 3 bilden die Gruppe Spezial (Omega 3, 5-Getreide etc.).","Les relevés se basent sur les modes de production : élevage au sol, élevage en plein air, bio, 5 céréales (aliments végétaux), Vital Omega 3 et AGRI-NATURA.  Pour le calcul, les modes de production élevage en libre parcours, élevage en plein air et AGRI-NATURA sont regroupés sous la dénomination élevage en libre parcours et en plein air. Les groupes 5-céréales et Vital Omega 3 forment le groupe spécial (Oméga 3, 5-céréales, …).","Nelle rilevazioni vengono considerati i seguenti metodi di allevamento: al suolo, all’aperto, biologico, somministrazione di 5 cereali (alimenti vegetali), Vital Omega 3 e AGRI-NATURA. Ai fini del calcolo le uova da allevamento all’aperto estensivo, allevamento convenzionale e AGRI-NATURA vengono raggruppate nella categoria allevamento all’aperto estensivo e convenzionale. I gruppi somministrazione di 5 cereali e Vital Omega 3 costituiscono la categoria speciale (Omega 3, 5 cereali, …)."]
[null,null,null,null,null,null,null,null,"■   Frisch / Gekocht","■   Frisch / Gekocht","■   Frais / cuits","■   Fresco / sodo"]
[null,null,null,null,null,null,null,null,"Die Erhebung differenziert zwischen rohen Eiern und gekochten Eiern.","Die Erhebung differenziert zwischen rohen Eiern und gekochten Eiern.","Les relevés distinguent entre œufs crus et cuits.","Nella rilevazione si distingue tra uova crude e uova sode."]
[null,null,null,null,null,null,null,null,"■   Anzahl Eier pro Schachtel","■   Anzahl Eier pro Schachtel","Nombre d’œufs par boîte","■   Numero di uova per cartone"]
[null,null,null,null,null,null,null,null,"Das Angebot beinhaltet die Schachtelgrössen 2er, 4er, 6er, 8er, 9er,10er, 12er, 15er,18er, 20er, 30er und einzelne Eier.","Das Angebot beinhaltet die Schachtelgrössen 2er, 4er, 6er, 8er, 9er,10er, 12er, 15er,18er, 20er, 30er und einzelne Eier.","L’offre comprend les boîtes de 4, 6, 8, 9, 10, 12, 15, 18, 20 et 30 œufs ainsi que la vente à la pièce.","In commercio vi sono cartoni da 2, 4, 6, 8, 9, 10, 12, 15, 18, 20 e 30 pezzi e uova sfuse."]
[null,null,null,null,null,null,null,null,"■   Gewichtsklasse","■   Gewichtsklasse","■   Classe de poids","■   Categoria di peso"]
[null,null,null,null,null,null,null,null,"Das Gewicht der Eier wird in die drei Gewichtsklassen <50 g, 50-53 g und >53 g aufgeteilt.","Das Gewicht der Eier wird in die drei Gewichtsklassen <50 g, 50-53 g und >53 g aufgeteilt.","Le poids des œufs est subdivisé en trois classes <50 g, 50-53 g et >53 g.","Per le uova esistono tre categorie di peso: <50g, 50-53g e >53g."]
[null,null,null,null,null,null,null,null,"■   Herkunft (Inland / Import)","■   Herkunft (Inland / Import)","■   Provenance (œufs du pays ou étrangers)","■   Provenienza (Svizzera / estero)"]
[null,null,null,null,null,null,null,null,"■   Preis in Fr./Schachtel","■   Preis in Fr./Schachtel","■   Prix en francs par boîte","■   Prezzo in fr. per cartone"]
[null,null,null,null,null,null,null,null,"■   Aktionen","■   Aktionen","■   Promotions","■   Offerte promozionali"]
[null,null,null,null,null,null,null,null,"Aktionen fliessen mit dem Faktor 1.5 in die Berechnung ein. Die nationalen Aktionen werden ab 09.2006 wöchentlich berücksichtigt.","Aktionen fliessen mit dem Faktor 1.5 in die Berechnung ein. Die nationalen Aktionen werden ab 09.2006 wöchentlich berücksichtigt.","Les actions promotionnelles sont prises en compte dans le calcul avec le coefficient 1,5.  Les promotions à l’échelle nationale sont prises en comptes régulièrement depuis le mois de septembre 2006.","Nel calcolo le offerte promozionali sono ponderate con il coefficiente 1.5. Le offerte promozionali nazionali sono prese in considerazione a cadenza settimanale a partire da settembre 2006."]
[null,null,null,null,null,null,null,null,"Methodik Berechnung","Methodik Berechnung","Méthode calcul","Metodo di calcolo"]
[null,null,null,null,null,null,null,null,"Gewichtungsdaten","Gewichtungsdaten","Pondération des données","Dati utilizzati per la ponderazione"]
[null,null,null,null,null,null,null,null,"■   Gewichtung nach Kanal (Quelle GfK AG)","■   Gewichtung nach Kanal (Quelle GfK AG)","■   pondération selon le canal (source: GfK AG) ","■   Ponderazione per canale (fonte GfK AG)"]
[null,null,null,null,null,null,null,null,"■   Gewichtung nach Region (Quelle BfS)","■   Gewichtung nach Region (Quelle BfS)","■   pondération selon la région (source: OFS) ","■   Ponderazione per regione (fonte BfS)"]
[null,null,null,null,null,null,null,null,"Die Regionen werden wie folgt abgegrenzt:","Die Regionen werden wie folgt abgegrenzt:","Les régions sont délimitées comme suit: ","Le regioni sono delimitate come segue:"]
[null,null,null,null,null,null,null,null,"Region I: Genf, Waadt, Freiburg, Neuenburg, Jura und Teile des französischsprachigen Gebiets des Kantons Bern (Verwaltungskreis Berner Jura).","Region I: Genf, Waadt, Freiburg, Neuenburg, Jura und Teile des französischsprachigen Gebiets des Kantons Bern (Verwaltungskreis Berner Jura).","Région I: Genève, Vaud, Neuchâtel, Jura et les parties francophones du canton de Berne (arrondissement administratif du Jura bernois). ","Regione I: Ginevra, Vaud, Friborgo, Neuchâtel, Giura e parti francofone del Cantone di Berna (Distretto amministrativo del Giura bernese). "]
[null,null,null,null,null,null,null,null,"Region II: Bern (ausser Verwaltungskreis Berner Jura), Luzern, Unterwalden (Obwalden, Nidwalden), Uri, Zug und ein Teil des Kantons Schwyz (Bezirke Schwyz, Gersau und Küssnacht).","Region II: Bern (ausser Verwaltungskreis Berner Jura), Luzern, Unterwalden (Obwalden, Nidwalden), Uri, Zug und ein Teil des Kantons Schwyz (Bezirke Schwyz, Gersau und Küssnacht).","Région II: Berne (sauf l’arrondissement administratif du Jura bernois), Lucerne, Unterwald (Obwald. Nidwald), Uri, Zoug et une partie du canton de Schwyz (district de Schwyz, Gersau et de Küssnacht). ","Regione II: Berna (tranne il Distretto amministrativo del Giura bernese), Lucerna, Untervaldo (Soprasselva, Sottoselva), Uri, Zugo e una parte del Cantone di Svitto (Distretti di Svitto, Gersau e Küssnacht). "]
[null,null,null,null,null,null,null,null,"Region III: Baselland und Basel-Stadt, Aargau und Solothurn.","Region III: Baselland und Basel-Stadt, Aargau und Solothurn.","Région III: Bâle-Campagne et Bâle-Ville, Argovie et Soleure. ","Regione III: Basilea Campagna e Basilea Città, Argovia e Soletta. "]
[null,null,null,null,null,null,null,null,"Region IV: Zürich, Schaffhausen, Thurgau, Appenzell (Innerrhoden und Ausserrhoden), St. Gallen, ein Teil des Kantons Schwyz (Bezirke Einsiedeln, March und Höfe), Glarus, Graubünden.","Region IV: Zürich, Schaffhausen, Thurgau, Appenzell (Innerrhoden und Ausserrhoden), St. Gallen, ein Teil des Kantons Schwyz (Bezirke Einsiedeln, March und Höfe), Glarus, Graubünden.","Région IV: Zurich, Schaffhouse, Thurgovie. Appenzell (Rhodes intérieures et Rhodes extérieures), St.-Gall, une partie du canton de Schwyz (districts d’Einsiedeln, March et Höfe), Glaris, Grisons. ","Regione IV: Zurigo, Sciaffusa, Turgovia, Appenzello (Interno ed Esterno), S. Gallo, parte del Cantone di Svitto (Distretti di Einsiedeln, March e Höfe), Glarona, Grigioni. "]
[null,null,null,null,null,null,null,null,"Region V: Wallis und Tessin.","Region V: Wallis und Tessin.","Région V: Valais et le Tessin. ","Regione V: Vallese e Ticino."]
[null,null,null,null,null,null,null,null,"Berechnung","Berechnung","Calcul","Calcolo"]
[null,null,null,null,null,null,null,null,"Anzahl Eier linear inkl. Aktionen:","Anzahl Eier linear inkl. Aktionen:","Nombre d’œufs disposés linéairement, offres promotionnelles comprises: ","Numero di uova sulla fila compr. le offerte promozionali:"]
[null,null,null,null,null,null,null,null,"= SL * ES * GA","= SL * ES * GA","= BL * OB * PA","= SL * ES * GA"]
[null,null,null,null,null,null,null,null,"Anzahl Eier linear pro Geschäft:","Anzahl Eier linear pro Geschäft:","Nombre d’œufs disposés linéairement par commerce: ","Numero di uova sulla fila per punto vendita:"]
[null,null,null,null,null,null,null,null,"= Summe (SL*ES*GA)","= Summe (SL*ES*GA)","= somme (BL*OB*PA) ","= totale (SL*ES*GA)"]
[null,null,null,null,null,null,null,null,"Angebot in % vom Gesamtangebot (pro Laden):","Angebot in % vom Gesamtangebot (pro Laden):","Pourcentage de l’offre par rapport à l’offre globale (par commerce): ","Offerta in % dell’offerta totale (per punto vendita):"]
[null,null,null,null,null,null,null,null,"= (SL*ES*GA) / (Summe(SL*ES*GA))","= (SL*ES*GA) / (Summe(SL*ES*GA))","= (BL*OB*PA) / (somme (BL*OB*PA) "," = (SL*ES*GA) / (totale (SL*ES*GA))"]
[null,null,null,null,null,null,null,null,"Gewichtungsschlüssel:","Gewichtungsschlüssel:","Clé de pondération: ","Chiave di ponderazione:"]
[null,null,null,null,null,null,null,null,"= (SL*ES*GA) / (Summe (SL*ES*GA)) * GR * GK","= (SL*ES*GA) / (Summe (SL*ES*GA)) * GR * GK","= (BL*OB*PA) / (somme (BL*OB*PA) * PR * PC "," = (SL*ES*GA) / (totale (SL*ES*GA)) * GR * GK"]
[null,null,null,null,null,null,null,null,"Preis pro Ei:","Preis pro Ei:","Prix par œuf: ","Prezzo per uovo:"]
[null,null,null,null,null,null,null,null,"= PS / ES","= PS / ES","= PB / OB"," = PS / ES"]
[null,null,null,null,null,null,null,null,"Gewichteter Preis:","Gewichteter Preis:","Prix pondéré: ","Prezzo ponderato:"]
[null,null,null,null,null,null,null,null,{"$f":"IF($I$1=\"d\",J326,IF($I$1=\"f\",K326,IF($I$1=\"i\",L326)))","v":"= (PS/ES)*(SL*ES*GA)/(SUMME(SL*ES *GA))*GR*GK"},"= (PS/ES)*(SL*ES*GA)/(SUMME(SL*ES *GA))*GR*GK","=(PB/OB)*(BL*OB*PA) / (somme (BL*OB*PA))*PR*PC ","= (PS/ES)*(SL*ES*GA)/(totale (SL*ES *GA))*GR*GK"]
[null,null,null,null,null,null,null,null,"Legende:","Legende:","Légende ","Legenda:"]
[null,null,null,null,null,null,null,null,"SL: Anzahl Schachteln linear","SL: Anzahl Schachteln linear","BL: Nombre de boîtes linéairement ","SL: Numero di cartoni (sulla fila)"]
[null,null,null,null,null,null,null,null,"ES: Anzahl Eier pro Schachtel","ES: Anzahl Eier pro Schachtel","OB: Nombre d’œufs par boîte ","ES: Numero di uova per cartone"]
[null,null,null,null,null,null,null,null,"GA: Gewichtung Aktionen","GA: Gewichtung Aktionen","PA: Pondération des actions promotionnelles ","GA: Ponderazione offerte speciali"]
[null,null,null,null,null,null,null,null,"GR: Gewichtung Regionen","GR: Gewichtung Regionen","PR: Pondération selon la région ","GR: Ponderazione regioni"]
[null,null,null,null,null,null,null,null,"GK: Gewichtung Kanäle","GK: Gewichtung Kanäle","PC: Pondération selon le canal ","GK: Ponderazione canali"]
[null,null,null,null,null,null,null,null,"PS: Preis pro Schachtel","PS: Preis pro Schachtel","PB: Prix par boîte","PS: Prezzo per cartone"]
[null,null,null,null,null,null,null,null,"Bruttowertschöpfung","Bruttowertschöpfung","Valeur ajoutée brute","Valore aggiunto lordo"]
[null,null,null,null,null,null,null,null,"Definition Einstandspreis","Definition Einstandspreis","Définition prix de revient ","Definizione di prezzo di costo"]
[null,null,null,null,null,null,null,null,"Der Einstandspreis errechnet sich aus dem Wert der Produzentenpreise für Schweizer Konsumeier inklusive der für die Verarbeitung bestimmten Eier (2. Klasse) und der importierten Konsum- und Verarbeitungseier (inkl. Zoll). Der Einstandspreis wird ohne Mehrwertsteuer (o.MwSt.) als Realwert (Festpreise von Dezember 2010) ausgedrückt. Zur Berechnung der Bruttowertschöpfung für Schweizer Eier der Produktionsformen Bio, Bodenhaltung und Freilandhaltung wird der vereinfachte Einstandspreis ohne Importe und ohne Verarbeitungseier herangezogen. Die Berechnung basiert auf einem dynamischen Mengengerüst. Als Grundlage dienen die Mengenverhältnisse der erhobenen Konsumentenpreise und die Produktion an Schweizer Schaleneiern (Quelle: Aviforum). Bei den Importeiern und den staatlichen Marktentlastungen handelt es sich um absolute Mengen. Interne Deklassierungen von Label- oder Freilandeiern zu Bodenhaltungseiern werden nicht in die Berechnung miteinbezogen.","Der Einstandspreis errechnet sich aus dem Wert der Produzentenpreise für Schweizer Konsumeier inklusive der für die Verarbeitung bestimmten Eier (2. Klasse) und der importierten Konsum- und Verarbeitungseier (inkl. Zoll). Der Einstandspreis wird ohne Mehrwertsteuer (o.MwSt.) als Realwert (Festpreise von Dezember 2010) ausgedrückt. Zur Berechnung der Bruttowertschöpfung für Schweizer Eier der Produktionsformen Bio, Bodenhaltung und Freilandhaltung wird der vereinfachte Einstandspreis ohne Importe und ohne Verarbeitungseier herangezogen. Die Berechnung basiert auf einem dynamischen Mengengerüst. Als Grundlage dienen die Mengenverhältnisse der erhobenen Konsumentenpreise und die Produktion an Schweizer Schaleneiern (Quelle: Aviforum). Bei den Importeiern und den staatlichen Marktentlastungen handelt es sich um absolute Mengen. Interne Deklassierungen von Label- oder Freilandeiern zu Bodenhaltungseiern werden nicht in die Berechnung miteinbezogen.","Le prix de revient se calcule à partir du prix à la production des œufs de consommation du pays y compris les œufs destinés à la fabrication (2e classe) et les œufs de consommation et de fabrication étrangers (taxes douanières comprises). Le prix de revient hors taxe sur la valeur ajoutée (hors TVA) est exprimé en valeur réelle (prix constant de décembre 2010). La valeur ajoutée brute pour les œufs du pays des modes de production bio, élevage au sol et élevage en libre parcours et en plein air, se calcule sur la base du prix de revient simplifié sans tenir compte des importations et sans les œufs de fabrication. Le calcul se base sur une grille de quantité dynamique. Les proportions des prix à la consommation relevés ainsi que la production mensuelle d’œufs en coquille suisse servent de base de calcul (source: Aviforum). Les quantités d’œufs étrangers et celles touchées par les mesures étatiques d’allégement du marché sont données en valeurs absolues. Les déclassements internes d’œufs labellisés ou bio en œufs d’élevage au sol ne sont pas intégrés au calcul.","Il prezzo di costo è dato dal valore dei prezzi alla produzione delle uova di consumo svizzere, incluse le uova destinate alla trasformazione (II classe) e delle uova di consumo e di trasformazione importate (incl. dazio). Il prezzo di costo è espresso imposta sul valore aggiunto (IVA) esclusa, a valore reale (prezzo costante da dicembre 2010). Per il calcolo del valore aggiunto lordo sulle uova svizzere biologiche, da allevamento al suolo e all’aperto, viene considerato un prezzo di costo semplificato, escluse le importazioni e le uova di trasformazione. Il calcolo è effettuato sulla base di una gamma di quantitativi dinamica. Come base vengono utilizzati i rapporti di quantità dei prezzi al consumo rilevati e la produzione di uova in guscio svizzere (fonte: Aviforum). Nel caso delle uova importate e dei provvedimenti statali di sgravio del mercato si tratta di quantitativi assoluti. Nel calcolo non si tiene conto dei declassamenti interni di uova label o da allevamento all'aperto in uova da allevamento al suolo."]
[null,null,null,null,null,null,null,null,"Definition Nettoeinnahmen im Liefer- und Abholgrosshandel und im Detailhandel","Definition Nettoeinnahmen im Liefer- und Abholgrosshandel und im Detailhandel","Définition des recettes nettes réalisées par le libre-service de gros et dans le commerce de détail","Definizione entrate nette per acquirenti e fornitori all’ingrosso e nel commercio al dettaglio"]
[null,null,null,null,null,null,null,null,"Die Nettoeinnahmen bestehen aus den beobachteten, gewichteten Preisen im Liefer- und Abholgrosshandel bzw. den Konsumentenpreisen für frische und gekochte Konsumeier, den Werten der aufgeschlagenen inländischen und importierten Verarbeitungseiern zu Grosshandelspreisen und den Eiern der durchgeführten Marktentlastungsmassnahmen. Die Nettoeinnahmen verstehen sich ohne Mehrwertsteuer (o.MwSt.) zu Realwerten (Festpreise von Dezember 2010). Zur Berechnung der Bruttowertschöpfung für Schweizer Eier der Produktionsformen Bio, Bodenhaltung und Freilandhaltung werden die vereinfachten Nettoeinnahmen ohne Importeier, Verarbeitungseier und ohne staatliche Marktentlastungen herangezogen.","Die Nettoeinnahmen bestehen aus den beobachteten, gewichteten Preisen im Liefer- und Abholgrosshandel bzw. den Konsumentenpreisen für frische und gekochte Konsumeier, den Werten der aufgeschlagenen inländischen und importierten Verarbeitungseiern zu Grosshandelspreisen und den Eiern der durchgeführten Marktentlastungsmassnahmen. Die Nettoeinnahmen verstehen sich ohne Mehrwertsteuer (o.MwSt.) zu Realwerten (Festpreise von Dezember 2010). Zur Berechnung der Bruttowertschöpfung für Schweizer Eier der Produktionsformen Bio, Bodenhaltung und Freilandhaltung werden die vereinfachten Nettoeinnahmen ohne Importeier, Verarbeitungseier und ohne staatliche Marktentlastungen herangezogen.","Les recettes nettes se calculent sur la base des prix dans le libre-service en gros et sur le prix à la consommation des œufs de consommation frais et cuits observés, pondérés, des données relatives aux œufs de fabrication cassés du pays et étrangers à prix de gros et des œufs provenant des mesures d’allégement du marché réalisées. Les recettes nettes s’entendent hors taxe sur la valeur ajoutée (hors TVA) à valeurs réelles (prix constant de décembre 2010). La valeur ajoutée brute pour les œufs du pays des modes de production bio, élevage au sol et élevage en libre parcours et en plein air, se calcule sur la base des recettes nettes simplifiées sans tenir compte des importations, des œufs de fabrication et des mesures étatiques d’allégement du marché.","Le entrate nette sono composte dai prezzi per acquirenti e fornitori all’ingrosso ponderati osservati o dai prezzi al consumo delle uova crude/sode, dai valori delle uova di trasformazione indigene e importate spezzate vendute ai prezzi dei grossisti e delle uova interessate dai provvedimenti adottati in materia di sgravio del mercato. Le entrate nette sono espresse IVA esclusa, a valore reale (prezzo costante da dicembre 2010). Per il calcolo del valore aggiunto lordo sulle uova svizzere biologiche, da allevamento al suolo e all’aperto estensivo o convenzionale, vengono considerate le entrate nette semplificate, escluse le uova importate, quelle di trasformazione e senza tener conto dei provvedimenti statali di sgravio del mercato."]
[null,null,null,null,null,null,null,null,"Definition Bruttowertschöpfung","Definition Bruttowertschöpfung","Définition valeur ajoutée brute","Definizione di valore aggiunto lordo"]
[null,null,null,null,null,null,null,null,"Die Bruttowertschöpfung ist die Differenz aus den definierten Nettoeinnahmen und den definierten Einstandspreisen ohne Mehrwertsteuer (o.MwSt.) zu Realwerten (Festpreis von Dezember 2010). Die Bruttowertschöpfung wird jeweils separat auf den Stufen Liefer- und Abholgrosshandel sowie Detailhandel berechnet. Sie verkörpert einen Schätzwert der effektiven Wertschöpfung auf den Konsumeiern im Ladenverkauf und dient nur als Indikator für die wirkliche Wertschöpfung der Pack- / Sammelstellen und der Verteiler. Bei der Bruttowertschöpfung gesamt fliessen die Importe, die Verarbeitungseier und die Marktentlastungsmassnahmen in die Berechnung mit ein. Die Verkäufe der Pack- und Sammelstellen direkt an Gewerbebetriebe (Restaurants, Bäckereien etc.) und an Kollektivhaushalte sowie die Direktvermarktung ab Hof wird in der Berechnung nicht berücksichtigt. Die Berechnung der Bruttowertschöpfung gesamt beruht auf der Annahme, dass sämtliche Konsumeier über den jeweiligen Kanal (Liefer- und Abholgrosshandel bzw. Detailhandel) abgesetzt werden.","Die Bruttowertschöpfung ist die Differenz aus den definierten Nettoeinnahmen und den definierten Einstandspreisen ohne Mehrwertsteuer (o.MwSt.) zu Realwerten (Festpreis von Dezember 2010). Die Bruttowertschöpfung wird jeweils separat auf den Stufen Liefer- und Abholgrosshandel sowie Detailhandel berechnet. Sie verkörpert einen Schätzwert der effektiven Wertschöpfung auf den Konsumeiern im Ladenverkauf und dient nur als Indikator für die wirkliche Wertschöpfung der Pack- / Sammelstellen und der Verteiler. Bei der Bruttowertschöpfung gesamt fliessen die Importe, die Verarbeitungseier und die Marktentlastungsmassnahmen in die Berechnung mit ein. Die Verkäufe der Pack- und Sammelstellen direkt an Gewerbebetriebe (Restaurants, Bäckereien etc.) und an Kollektivhaushalte sowie die Direktvermarktung ab Hof wird in der Berechnung nicht berücksichtigt. Die Berechnung der Bruttowertschöpfung gesamt beruht auf der Annahme, dass sämtliche Konsumeier über den jeweiligen Kanal (Liefer- und Abholgrosshandel bzw. Detailhandel) abgesetzt werden.","La valeur ajoutée brute constitue la différence entre les recettes nettes et les prix de revient définis, hors taxe sur la valeur ajoutée (hors TVA) et à valeurs réelles (prix constant de décembre 2010). La valeur ajoutée brute est calculée séparément, à l’échelon du libre-service de gros et à l’échelon du commerce de détail. Elle représente une valeur estimée de la valeur ajoutée effective prélevée sur les œufs de consommation en vente au magasin et sert uniquement d’indicateur de la valeur ajoutée effective prélevée par les centres d’emballage et de collecte ainsi que par les distributeurs. La valeur ajoutée brute totale quant à elle inclut dans son calcul les importations, les œufs de fabrication et les mesures d’allégement du marché. Les ventes des centres d’emballage et de collecte aux entreprises artisanales (restaurants, boulangeries, etc.) et aux ménages collectifs ainsi que la vente directe à la ferme ne sont pas prises en considération dans ce calcul. Le calcul de la valeur ajoutée brute totale repose sur l’hypothèse que l’ensemble des œufs de consommation est écoulé par le canal correspondant (libre-service de gros ou commerce de détail).","Il valore aggiunto lordo è la differenza tra le entrate nette definite e i prezzi di costo definiti, IVA esclusa, a valore reale (prezzo costante da dicembre 2010). È calcolato separatamente ai livelli acquirenti e fornitori all'ingrosso nonché commercio al dettaglio. Il valore aggiunto lordo rappresenta una stima del valore aggiunto effettivo sulle uova di consumo in commercio e serve esclusivamente da indicatore per il vero valore aggiunto dei centri di imballaggio/raccolta e dei distributori. Nel calcolo del valore aggiunto lordo si tiene conto delle importazioni, delle uova di trasformazione e dei provvedimenti di sgravio del mercato. Al contrario, non viene tenuto conto delle vendite dei centri d’imballaggio/raccolta direttamente ad aziende artigianali (ristoranti, panifici, ecc.) e a economie domestiche collettive, come pure della vendita diretta presso l’azienda. Il calcolo del valore aggiunto lordo si basa sull’ipotesi che tutte le uova di consumo vengano smerciate nel rispettivo canale (acquirenti e fornitori all'ingrosso o commercio al dettaglio)."]
[null,null,null,null,null,null,null,null,"Produzentenpreisanteil am Konsumenten- bzw. Gastronomenfranken","Produzentenpreisanteil am Konsumenten- bzw. Gastronomenfranken","Part du prix à la production sur le franc payé par le consommateur ou le restaurateur","Quota del prezzo alla produzione per ogni franco speso dal consumatore e dalla ristorazione"]
[null,null,null,null,null,null,null,null,"Der Anteil des Produzentenpreises am Konsumenten- bzw. Gastronomenfranken entspricht dem Erlösanteil am Rohertrag, welcher der Landwirt durch den Verkauf der Eier im Verhältnis zu den Einnahmen im Detailhandel bzw. im Liefer- und Abholgrosshandel erwirtschaftet.","Der Anteil des Produzentenpreises am Konsumenten- bzw. Gastronomenfranken entspricht dem Erlösanteil am Rohertrag, welcher der Landwirt durch den Verkauf der Eier im Verhältnis zu den Einnahmen im Detailhandel bzw. im Liefer- und Abholgrosshandel erwirtschaftet.","La part du prix à la production sur le franc payé par le consommateur ou le restaurateur correspond à la part de la recette sur le rendement brut réalisé par l’agriculteur via la vente des œufs, par rapport aux recettes réalisées dans le commerce de détail ou dans le libre-service de gros.","La quota del prezzo alla produzione per ogni franco speso dal consumatore e dalla ristorazione corrisponde alla quota di ricavato sul reddito lordo che l’agricoltore realizza mediante la vendita di uova, rispetto alle entrate nel commercio al dettaglio e degli acquirenti e fornitori all’ingrosso."]
[null,null,null,null,null,null,null,null,"International","International","International","Situazione a livello internazionale"]
[null,null,null,null,null,null,null,null,"Internationale Preise werden sowohl auf Produzenten- als auch auf Konsumentenstufe erhoben. Erfasst werden die Preise in Deutschland und Österreich. Die Datenquellen sind vorwiegend privatrechtliche Institutionen und Bundesämter.","Internationale Preise werden sowohl auf Produzenten- als auch auf Konsumentenstufe erhoben. Erfasst werden die Preise in Deutschland und Österreich. Die Datenquellen sind vorwiegend privatrechtliche Institutionen und Bundesämter.","Les prix internationaux sont relevés aussi à l’échelon du producteur qu’à celui du consommateur. Les prix sont relevés en Allemagne et en Autriche Les données proviennent essentiellement d’institutions de droit privé et d’offices fédéraux.","I prezzi internazionali sono rilevati a livello sia di produzione sia di consumo. I prezzi sono registrati in Germania e in Austria. Le fonti dei dati sono prevalentemente istituzioni di diritto privato e uffici federali."]
[null,null,null,null,null,null,null,null,{"$f":"IF($I$1=\"d\",J345,IF($I$1=\"f\",K345,IF($I$1=\"i\",L345)))","v":"Die Grafik zeigt die Berechnungen für die Bruttowertschöpfung für Schweizer Konsumeier und für die gesamte Bruttowertschöpfung der Pack-/Sammelstellen und der Verteiler im Detailhandel auf."},"Die Grafik zeigt die Berechnungen für die Bruttowertschöpfung für Schweizer Konsumeier und für die gesamte Bruttowertschöpfung der Pack-/Sammelstellen und der Verteiler im Detailhandel auf.","Le graphique présente les calculs De la valeur ajoutée brute sur les œufs de consommation du pays ainsi que de celle des centres d’emballage et de collecte et des distributeurs.","Il grafico illustra il calcolo die valori aggiunti lordi sulle uova di consumo svizzere e del valore aggiunto lordo totale dei centri d’imballaggio/raccolta e dei distributori."]
[null,null,null,null,null,null,null,null,"Die Verhältnisse in diesem Diagramm sind nicht realitätsgetreu.","Die Verhältnisse in diesem Diagramm sind nicht realitätsgetreu.","Les proportions de ce diagramme n’ont pas été respectées","proporzioni del diagramma non sono reali."]
[null,null,null,null,null,null,null,null,"Die Grafik zeigt die Berechnungen für die Bruttowertschöpfung für Schweizer Konsumeier und für die gesamte Bruttowertschöpfung der Pack-/Sammelstellen und der Verteiler auf.","Die Grafik zeigt die Berechnungen für die Bruttowertschöpfung für Schweizer Konsumeier und für die gesamte Bruttowertschöpfung der Pack-/Sammelstellen und der Verteiler auf.","Le graphique présente les calculs de la valeur ajoutée brute sur les œufs de consommation du pays ainsi que de celle des centres d’emballage et de collecte et des distributeurs.","Il grafico illustra il calcolo dei valori aggiunti lordi sulle uova di consumo svizzere e del valore aggiunto lordo totale dei centri d’imballaggio/raccolta e dei distributori."]
[null,null,null,null,null,null,null,null,"Die Verhältnisse in diesem Diagramm sind nicht realitätsgetreu.","Die Verhältnisse in diesem Diagramm sind nicht realitätsgetreu.","Les proportions de ce diagramme n’ont pas été respectées","proporzioni del diagramma non sono reali."]
[null,null,null,null,null,null,null,null,"Nettoeinnahmen gesamt","Nettoeinnahmen gesamt","Recettes nettes totales","entrate nette totali"]
[null,null,null,null,null,null,null,null,"Nettoeinnahmen CH-Konsumeier","Nettoeinnahmen CH-Konsumeier","Recettes nettes œufs consommation CH","entrate nette uova di consumo CH "]
[null,null,null,null,null,null,null,null,"Wert der Import-Konsumeier roh und gekocht, zu Detailhandelspreisen","Wert der Import-Konsumeier roh und gekocht, zu Detailhandelspreisen","Valeur des œufs de consommation étrangers crus et cuits au prix de détail","valore uova di consumo importate crude /  sode ai prezzi al dettaglio"]
[null,null,null,null,null,null,null,null,"Wert der CH-Konsumeier roh und gekocht, zu Detailhandels-preisen","Wert der CH-Konsumeier roh und gekocht, zu Detailhandels-preisen","Valeur des œufs de consommation CH crus et cuits au prix de détail","valore uova di consumo CH crude / sode ai prezzi al dettaglio"]
[null,null,null,null,null,null,null,null,"Wert der Verarbeitungseier aufgeschlagen (CH-Eier 2.Klasse Verarbeitungseier Import) zu Grosshandelspreisen","Wert der Verarbeitungseier aufgeschlagen (CH-Eier 2.Klasse Verarbeitungseier Import) zu Grosshandelspreisen","Valeur des œufs de fabrication cassés (oeufs CH 2ème catégorie, œufs de fabrication importation) trop gros prix du commerce","valore uova di transformatione (uova CH II classe, uova di transf. importate) ai prezzi all‘ingrosso"]
[null,null,null,null,null,null,null,null,"Wert der Eier für Marktentlastung (Verbilligungsaktion Aufschlagaktion)","Wert der Eier für Marktentlastung (Verbilligungsaktion Aufschlagaktion)","Valeur des œufs pour l‘allégement du marché (actions de vente à prix réduit, actions d‘oeufs cassés)","valore uova per sgravio mercato (azione riduzione prezzi, spezzatura)"]
[null,null,null,null,null,null,null,null,"Bruttowertschöpfung CH-Konsumeier","Bruttowertschöpfung CH-Konsumeier","Valeur ajoutée brute œufs de consommation CH","Valore aggiunto lordo uova consumo CH"]
[null,null,null,null,null,null,null,null,"Wert der CH-Verarbeitungseier zu Produzenten-preisen","Wert der CH-Verarbeitungseier zu Produzenten-preisen","Valeur des œufs de transformation CH au prix à la production","valore uova di transformatione CH ai prezzi alla produzione"]
[null,null,null,null,null,null,null,null,"Wert der CH-Konsumeier zu Produzentenpreisen","Wert der CH-Konsumeier zu Produzentenpreisen","Valeur des œufs de consommation CH au prix à la production ","valore uova di consumo CH ai prezzi alla produzione"]
[null,null,null,null,null,null,null,null,"Zoll","Zoll","Douane","dazio"]
[null,null,null,null,null,null,null,null,"Wert Verarbeitungseier Import","Wert Verarbeitungseier Import","Valeur des œufs de fabrication étrangers","valore uova di transformatione importate"]
[null,null,null,null,null,null,null,null,"Wert Konsumeier Import","Wert Konsumeier Import","Valeur des œufs de consommation étrangers","valore uova di consumo importate"]
[null,null,null,null,null,null,null,null,"Bruttowertschöpfung gesamt","Bruttowertschöpfung gesamt","Valeur ajoutée brute totale","Valore aggiunto lordo totale"]
[null,null,null,null,null,null,null,null,"Einstandspreis CH-Konsumeier","Einstandspreis CH-Konsumeier","Prix de revient œufs  consommation CH","prezzo di costo uova di consumo CH"]
[null,null,null,null,null,null,null,null,"Einstandspreis gesamt","Einstandspreis gesamt","Prix de revient total","prezzo di costo totale"]
[null,null,null,null,null,null,null,null,0]
[null,null,null,null,null,null,null,"Dashboard","Produktion und Import","Produktion und Import","Production et importation","Produzione e importazione"]
[null,null,null,null,null,null,null,null,"Bruttowertschöpfung in der Verarbeitung und Verteilung (Detailhandel)","Bruttowertschöpfung in der Verarbeitung und Verteilung (Detailhandel)","Valeur ajoutée brute dans la transformation et la distribution (commerce de détail)","Valore aggiunto lordo nella trasformazione e distribuzione (commercio al dettaglio)"]
[null,null,null,null,null,null,null,null,"Bruttowertschöpfung in der Verarbeitung und Verteilung (Liefer- und Abholgrosshandel)","Bruttowertschöpfung in der Verarbeitung und Verteilung (Liefer- und Abholgrosshandel)","Valeur ajoutée brute dans la transformation et la distribution (libre service de gros)","Valore aggiunto lordo nella trasformazione e distribuzione (acquirenti e fornitori all’ingrosso)"]
[null,null,null,null,null,null,null,null,"*Erhebung seit 2013","*Erhebung seit 2013","*Relevé depuis 2013","*Rilevazione dal 2013"]
[null,null,null,null,null,null,null,null,"Liefer- und Abholgrosshandel*","Liefer- und Abholgrosshandel*","Libre-service de gros*","Fornitura e nell’acquisto all’ingrosso*"]
[null,null,null,null,null,null,null,null,"Detailhandel**","Detailhandel**","Commerce de détail**","Commercio al dettaglio**"]
[null,null,null,null,null,null,null,null,"**Anteile anhand des linearen Angebots im Verkaufsregal","**Anteile anhand des linearen Angebots im Verkaufsregal","**Parts sur la base de l’offre linéaire dans les rayons","**Quote sulla base dell'offerta lineare sullo scaffale"]
[null,null,null,null,null,null,null,null,"Ø Klassen M / L","Ø Klassen M / L","Ø Classes M / L","Ø classi M / L"]
[null,null,null,null,null,null,null,null,"Preise entlang der Werschöpfungskette","Preise entlang der Werschöpfungskette","Prix le long de la chaine de création de valeur","Prezzi lungo la catena del valore aggiunto"]
[null,null,null,null,null,null,null,null,"Mengen- und Verbrauchsentwicklung","Mengen- und Verbrauchsentwicklung","Évolution des quantités et de la consommation","Evoluzione dei quantitativi e dei consumi"]
[null,null,null,null,null,null,null,null,"Marktentlastungsmassnahmen ","Marktentlastungsmassnahmen ","Mesures d’allégement du marché ","Provvedimenti di sgravio del mercato"]
[null,null,null,null,null,null,null,null,"Marktstruktur","Marktstruktur","Structure du marché","Struttura del mercato"]
[null,null,null,null,null,null,null,null,"Bruttowertschöpfung","Bruttowertschöpfung","Valeur ajoutée brute","Valore aggiunto lordo"]
[null,null,null,null,null,null,null,null,"International","International","International","Situazione a livello internazionale"]
[null,null,null,null,null,null,null,null,"Preise international","Preise international","Prix internationaux","Prezzi internazionali"]
[null,null,null,null,null,null,null,null,"Das BLW hat auf Anträgen der Branche das Kontingent für Konsumeierimporte um insgesamt 3'500 Tonnen erhöht infolge der hohen Nachfrage nach Schaleneiern wegen des vermehrten pandemiebedingten Konsums zu Hause","Das BLW hat auf Anträgen der Branche das Kontingent für Konsumeierimporte um insgesamt 3'500 Tonnen erhöht infolge der hohen Nachfrage nach Schaleneiern wegen des vermehrten pandemiebedingten Konsums zu Hause","A la demande de la branche, l'OFAG a augmenté le contingent d'importation d'œufs de consommation de 3500 tonnes au total, en raison de la forte demande d'œufs en coquille due à l'augmentation de la consommation domestique consécutive à la pandémie.","Su richiesta dell'industria, l'UFAG ha aumentato il contingente d'importazione delle uova da tavola di un totale di 3500 tonnellate a causa della forte domanda di uova in guscio dovuta all'aumento del consumo in patria in seguito alla pandemia."]
[null,null,null,null,null,null,null,null,"Die Überschreitung der Kontingentsmenge ist möglich.","Die Überschreitung der Kontingentsmenge ist möglich.","Le dépassement quantitatif du contingent tarifaire est possible.","Il superamento del quantitativo del contingente è possibile."]